{"text_format":"1","workbook":"xlsx","n_sheets":10,"sheets":["PAGINA_PRINCIPALE","modelli","develop_docs","Gener_1819","Gener_1920","Cybersec_1920","IoT_1920","CommTech_1920","scelte_1920","scelte_1819"],"not_rendered":{"charts":0,"images":0,"macros":1,"external_links":0,"defined_names":10,"comments":0,"pivot_tables":0},"unopened":[],"bounds":{"document_bytes":16777216,"sheet_cells":100000,"rows_first":2000,"rows_last":500,"rows_between":2000,"halvings":0,"cell_chars":16384,"cell_head_chars":4096},"cells_cut":0,"cells_raw":0,"read":"whole","date_system":"1900"}

{"sheet":"PAGINA_PRINCIPALE","index":0,"n_rows":21,"n_cols":17,"rows_kept":21,"cut":false,"hidden":false,"merged":[[11,2,11,6],[11,8,11,11],[9,2,9,6],[9,8,9,11],[7,8,7,11],[10,2,10,6],[10,8,10,11],[1,1,1,11],[2,1,2,11],[7,2,7,6],[8,2,8,6],[8,8,8,11],[12,8,12,11],[18,2,18,13],[20,1,20,13],[13,2,13,4],[13,8,13,11]]}
[null,null,null,null,null,null,null,null,null,null,null,null,null,"pds-2021-L-v14"]
[null,"Corso di Laurea in Ingegneria di Internet - Piano di studi 2020/21"]
[null,"Istruzioni e Riepilogo"]
[null,"CFU Totali",{"$f":"IF(P19<>\"\",INDIRECT(P19&\"!c4\"),\"-\")","v":"-"},null,"CFU Mancanti",{"$f":"IF(P19<>\"\",INDIRECT(P19&\"!F4\"),\"-\")","v":"-"},null,"Modello del piano",{"$f":"P19","v":""}]
[null,"CFU Sovrannum.",{"$f":"IF(P19<>\"\",INDIRECT(P19&\"!c5\"),\"-\")","v":"-"},null,"Stato",{"$f":"IF(P19<>\"\",INDIRECT(P19&\"!F5\"),\"-\")","v":"-"}]
[null,null,null,null,null,null,null,null,null,null,null,null,null,"Locked"]
[]
[null,"Cognome Nome:",null,null,null,null,null,null,{"$f":"IF(C8=\"\",\"ERRORE - Inserire Cognome Nome\",\"OK\")","v":"ERRORE - Inserire Cognome Nome"}]
[null,"Matricola:",null,null,null,null,null,null,{"$f":"IF(C9=\"\",\"ERRORE - Inserire Matricola\",\"OK\")","v":"ERRORE - Inserire Matricola"}]
[null,"Codice Fiscale",null,null,null,null,null,null,{"$f":"Q10","v":"ERRORE - Inserire Codice Fiscale"},null,null,null,null,null,null,{"$f":"IF(AND(UPPER(MID(C10,16,1))=CHAR(MOD((CODE(MID(UPPER(C10),2,1))-65)+(CODE(MID(UPPER(C10),4,1))-65)+(CODE(MID(UPPER(C10),6,1))-65)+(CODE(MID(UPPER(C10),8,1))-48)+(CODE(MID(UPPER(C10),10,1))-48)+(CODE(MID(UPPER(C10),12,1))-65)+(CODE(MID(UPPER(C10),14,1))-48)+(FIND(MID(UPPER(C10),1,1),\"BAKPLCQDREVOSFTGUHMINJWZYX\")-1)+(FIND(MID(UPPER(C10),3,1),\"BAKPLCQDREVOSFTGUHMINJWZYX\")-1)+(FIND(MID(UPPER(C10),5,1),\"BAKPLCQDREVOSFTGUHMINJWZYX\")-1)+(FIND(MID(UPPER(C10),7,1),\"10AAA2A3A4AAA5A6A7A8A9\")-1)+(FIND(MID(UPPER(C10),9,1),\"BAKPLCQDREVOSFTGUHMINJWZYX\")-1)+(FIND(MID(UPPER(C10),11,1),\"10AAA2A3A4AAA5A6A7A8A9\")-1)+(FIND(MID(UPPER(C10),13,1),\"10AAA2A3A4AAA5A6A7A8A9\")-1)+(FIND(MID(UPPER(C10),15,1),\"10AAA2A3A4AAA5A6A7A8A9\")-1),26)+65),LEN(C10)=16),\"OK\",\"ERRORE - Codice Fiscale errato\")","v":{"$error":"#VALUE!"}},{"$f":"IF(C10=\"\", \"ERRORE - Inserire Codice Fiscale\",IF(ISERROR(P10),\"ERRORE - Codice Fiscale errato\",P10))","v":"ERRORE - Inserire Codice Fiscale"}]
[null,"E-mail:",null,null,null,null,null,null,{"$f":"Q11","v":"ERRORE - Inserire e-mail"},null,null,null,null,null,null,{"$f":"ISNUMBER(MATCH(\"*@*.?*\",C11,0))","v":false},{"$f":"IF(C11=\"\",\"ERRORE - Inserire e-mail\",IF(P11,\"OK\",\"ERRORE - E-mail non corretta\"))","v":"ERRORE - Inserire e-mail"}]
[null,"Telefono:",null,null,null,null,null,null,{"$f":"IF(C12=\"\",\"ERRORE - Inserire Telefono\",\"OK\")","v":"ERRORE - Inserire Telefono"}]
[null,"Anno di Corso (I, II, III):","-",null,null,null,null,null,{"$f":"IF(C13=\"-\",\"ERRORE - Inserire Anno di Corso\",\"OK\")","v":"ERRORE - Inserire Anno di Corso"}]
[null,"In corso/Fuori corso","-",null,null,null,null,null,{"$f":"IF(C14=\"-\",\"ERRORE - Indicare In corso / Fuori corso\",\"OK\")","v":"ERRORE - Indicare In corso / Fuori corso"}]
[]
[]
[null,"Inserire i dati anagrafici sopra, poi scegliere il modelo di piano dal menu a tendina qui sotto"]
[]
[null,"Modello scelto","-",null,null,null,null,null,null,null,null,null,null,null,null,{"$f":"IF(C19<>\"-\",LEFT(MID(C19,4,20),FIND(\" \",MID(C19,4,20))-1),\"\")","v":""}]
[]
[null,"Compilare quindi il foglio corrispondente al modello scelto.\n\nPer ogni esame selezionato come \"Da sostenere\" o \"Sostenuto\" va indicato l'anno effettivo in cui si pianifica di sostenere o in cui si è sostenuto l'esame, altrimenti viene segnalato un errore.\nPer ogni esame selezionato con \"NO\", l'anno effettivo deve essere cancellato selezionando \"-\".\n\nI piani consegnati devono contenere nell'intestazione del foglio \"PAGINA_PRINCIPALE\"  il messaggio:\n\"IL PIANO NON CONTIENE ERRORI FORMALI\".\n\nSalvare il file chiamandolo con il vostro cognome: cognome.xlsm e inviarlo come allegato e-mail all'indirizzo: ingegneriainternet@gmail.com mettendo come oggetto: \"invio piano di studi 2021\""]

{"sheet":"modelli","index":1,"n_rows":7,"n_cols":1,"rows_kept":7,"cut":false,"hidden":true,"merged":[]}
["The list needs to be sorted!!"]
["-"]
["1) Gener_1819 - Piano di studi per gli studenti immatricolati fino al 2018/19"]
["2) Gener_1920 - Piano di studi generico per gli studenti immatricolati dal 2019/20"]
["3) Cybersec_1920  - Piano di studi per gli studenti immatricolati dal 2019/20, percorso Cybersecurity"]
["4) IoT_1920 - Piano di studi per gli studenti immatricolati dal 2019/20, percorso Internet of Things"]
["5) CommTech_1920 - Piano di studi per gli studenti immatricolati dal 2019/20, percorso Communication Technologies"]

{"sheet":"develop_docs","index":2,"n_rows":24,"n_cols":3,"rows_kept":24,"cut":false,"hidden":true,"merged":[]}
[]
[]
[null,"https://www.extendoffice.com/documents/excel/4303-excel-data-validation-email-address.html"]
[null,"=ISNUMBER(MATCH(\"*@*.?*\",A2,0))"]
[]
[null,"Ho inserito una macro per evitare gli email hyperlinks"]
[null,"Private Sub Worksheet_Change(ByVal Target As Range)"]
[null,"'PURPOSE: Prevent any new hyperlinks from auto-generating"]
[]
[null,"Formula excel/openoffice per il controllo di P.IVA e Codice"]
[null,"trovata su google"]
[]
[null,"=IF(UPPER(MID(A2,16,1))=CHAR(MOD((CODE(MID(UPPER(A2),2,1))-65)+(CODE(MID(UPPER(A2),4,1))-65)+(CODE(MID(UPPER(A2),6,1))-65)+(CODE(MID(UPPER(A2),8,1))-48)+(CODE(MID(UPPER(A2),10,1))-48)+(CODE(MID(UPPER(A2),12,1))-65)+(CODE(MID(UPPER(A2),14,1))-48)+(FIND(MID(UPPER(A2),1,1),\"BAKPLCQDREVOSFTGUHMINJWZYX\")-1)+(FIND(MID(UPPER(A2),3,1),\"BAKPLCQDREVOSFTGUHMINJWZYX\")-1)+(FIND(MID(UPPER(A2),5,1),\"BAKPLCQDREVOSFTGUHMINJWZYX\")-1)+(FIND(MID(UPPER(A2),7,1),\"10AAA2A3A4AAA5A6A7A8A9\")-1)+(FIND(MID(UPPER(A2),9,1),\"BAKPLCQDREVOSFTGUHMINJWZYX\")-1)+(FIND(MID(UPPER(A2),11,1),\"10AAA2A3A4AAA5A6A7A8A9\")-1)+(FIND(MID(UPPER(A2),13,1),\"10AAA2A3A4AAA5A6A7A8A9\")-1)+(FIND(MID(UPPER(A2),15,1),\"10AAA2A3A4AAA5A6A7A8A9\")-1),26)+65),\"OK\",\"ERRATO\")"]
[]
[null,"non controllava la lunghezza della stringa","inserire qui un codice fiscale"]
[null,"questa versione sotto la controlla e parte da un upper","slssfn69p15h501k"]
[null,{"$f":"IF(AND(MID(C17,16,1)=CHAR(MOD((CODE(MID(C17,2,1))-65)+(CODE(MID(C17,4,1))-65)+(CODE(MID(C17,6,1))-65)+(CODE(MID(C17,8,1))-48)+(CODE(MID(C17,10,1))-48)+(CODE(MID(C17,12,1))-65)+(CODE(MID(C17,14,1))-48)+(FIND(MID(C17,1,1),\"BAKPLCQDREVOSFTGUHMINJWZYX\")-1)+(FIND(MID(C17,3,1),\"BAKPLCQDREVOSFTGUHMINJWZYX\")-1)+(FIND(MID(C17,5,1),\"BAKPLCQDREVOSFTGUHMINJWZYX\")-1)+(FIND(MID(C17,7,1),\"10AAA2A3A4AAA5A6A7A8A9\")-1)+(FIND(MID(C17,9,1),\"BAKPLCQDREVOSFTGUHMINJWZYX\")-1)+(FIND(MID(C17,11,1),\"10AAA2A3A4AAA5A6A7A8A9\")-1)+(FIND(MID(C17,13,1),\"10AAA2A3A4AAA5A6A7A8A9\")-1)+(FIND(MID(C17,15,1),\"10AAA2A3A4AAA5A6A7A8A9\")-1),26)+65),LEN(C17)=16),\"OK\",\"ERRORE - Inserire Codice Fiscale\")","v":"OK"},{"$f":"UPPER(C16)","v":"SLSSFN69P15H501K"}]
[null,{"$f":"IF(ISERROR(B17),\"ERRORE - Inserire Codice Fiscale\",B17)","v":"OK"}]
[]
[]
[null,"versione che controlla la lunghezza, senza passaggio intermedio… problema che da' errore se la stringa non c'e'"]
[null,"=IF(AND(UPPER(MID(C17,16,1))=CHAR(MOD((CODE(MID(UPPER(C17),2,1))-65)+(CODE(MID(UPPER(C17),4,1))-65)+(CODE(MID(UPPER(C17),6,1))-65)+(CODE(MID(UPPER(C17),8,1))-48)+(CODE(MID(UPPER(C17),10,1))-48)+(CODE(MID(UPPER(C17),12,1))-65)+(CODE(MID(UPPER(C17),14,1))-48)+(FIND(MID(UPPER(C17),1,1),\"BAKPLCQDREVOSFTGUHMINJWZYX\")-1)+(FIND(MID(UPPER(C17),3,1),\"BAKPLCQDREVOSFTGUHMINJWZYX\")-1)+(FIND(MID(UPPER(C17),5,1),\"BAKPLCQDREVOSFTGUHMINJWZYX\")-1)+(FIND(MID(UPPER(C17),7,1),\"10AAA2A3A4AAA5A6A7A8A9\")-1)+(FIND(MID(UPPER(C17),9,1),\"BAKPLCQDREVOSFTGUHMINJWZYX\")-1)+(FIND(MID(UPPER(C17),11,1),\"10AAA2A3A4AAA5A6A7A8A9\")-1)+(FIND(MID(UPPER(C17),13,1),\"10AAA2A3A4AAA5A6A7A8A9\")-1)+(FIND(MID(UPPER(C17),15,1),\"10AAA2A3A4AAA5A6A7A8A9\")-1),26)+65),LEN(C17)=16),\"OK\",\"ERRATO\")"]
[]
[null,{"$f":"IF(AND(UPPER(MID(M10,16,1))=CHAR(MOD((CODE(MID(UPPER(M10),2,1))-65)+(CODE(MID(UPPER(M10),4,1))-65)+(CODE(MID(UPPER(M10),6,1))-65)+(CODE(MID(UPPER(M10),8,1))-48)+(CODE(MID(UPPER(M10),10,1))-48)+(CODE(MID(UPPER(M10),12,1))-65)+(CODE(MID(UPPER(M10),14,1))-48)+(FIND(MID(UPPER(M10),1,1),\"BAKPLCQDREVOSFTGUHMINJWZYX\")-1)+(FIND(MID(UPPER(M10),3,1),\"BAKPLCQDREVOSFTGUHMINJWZYX\")-1)+(FIND(MID(UPPER(M10),5,1),\"BAKPLCQDREVOSFTGUHMINJWZYX\")-1)+(FIND(MID(UPPER(M10),7,1),\"10AAA2A3A4AAA5A6A7A8A9\")-1)+(FIND(MID(UPPER(M10),9,1),\"BAKPLCQDREVOSFTGUHMINJWZYX\")-1)+(FIND(MID(UPPER(M10),11,1),\"10AAA2A3A4AAA5A6A7A8A9\")-1)+(FIND(MID(UPPER(M10),13,1),\"10AAA2A3A4AAA5A6A7A8A9\")-1)+(FIND(MID(UPPER(M10),15,1),\"10AAA2A3A4AAA5A6A7A8A9\")-1),26)+65),LEN(M10)=16),\"OK\",\"ERRATO\")","v":{"$error":"#VALUE!"}}]

{"sheet":"Gener_1819","index":3,"n_rows":75,"n_cols":14,"rows_kept":75,"cut":false,"hidden":false,"merged":[[9,2,9,6],[9,8,9,11],[14,2,14,6],[7,8,7,11],[1,1,1,11],[2,1,2,11],[7,2,7,6],[8,2,8,6],[8,8,8,11],[70,3,70,4],[74,3,74,6],[10,2,10,6],[10,8,10,11],[11,2,11,6],[11,8,11,11],[12,8,12,11],[13,2,13,4],[13,8,13,11]]}
[]
[null,"Corso di Laurea in Ingegneria di Internet - Piano di studi 2020/21"]
[null,"Modello Generico 2018/19"]
[null,"CFU Totali",{"$f":"D67","v":153},null,"CFU Mancanti",{"$f":"MAX(0,180-C4)","v":27}]
[null,"CFU Sovrannum.",{"$f":"D68","v":0},null,"Stato",{"$f":"D75","v":"IL PIANO CONTIENE DEGLI ERRORI FORMALI (2)"}]
[]
[]
[null,"Cognome Nome:",{"$f":"IF(PAGINA_PRINCIPALE!C8=0,\"\",PAGINA_PRINCIPALE!C8)","v":""},null,null,null,null,null,{"$f":"PAGINA_PRINCIPALE!I8","v":"ERRORE - Inserire Cognome Nome"}]
[null,"Matricola:",{"$f":"IF(PAGINA_PRINCIPALE!C9=0,\"\",PAGINA_PRINCIPALE!C9)","v":""},null,null,null,null,null,{"$f":"PAGINA_PRINCIPALE!I9","v":"ERRORE - Inserire Matricola"}]
[null,"Codice Fiscale",{"$f":"IF(PAGINA_PRINCIPALE!C10=0,\"\",PAGINA_PRINCIPALE!C10)","v":""},null,null,null,null,null,{"$f":"PAGINA_PRINCIPALE!I10","v":"ERRORE - Inserire Codice Fiscale"}]
[null,"E-mail:",{"$f":"IF(PAGINA_PRINCIPALE!C11=0,\"\",PAGINA_PRINCIPALE!C11)","v":""},null,null,null,null,null,{"$f":"PAGINA_PRINCIPALE!I11","v":"ERRORE - Inserire e-mail"}]
[null,"Telefono:",{"$f":"IF(PAGINA_PRINCIPALE!C12=0,\"\",PAGINA_PRINCIPALE!C12)","v":""},null,null,null,null,null,{"$f":"PAGINA_PRINCIPALE!I12","v":"ERRORE - Inserire Telefono"}]
[null,"Anno di Corso (I, II, III):",{"$f":"IF(PAGINA_PRINCIPALE!C13=0,\"\",PAGINA_PRINCIPALE!C13)","v":"-"},null,null,null,null,null,{"$f":"PAGINA_PRINCIPALE!I13","v":"ERRORE - Inserire Anno di Corso"}]
[null,"In corso/Fuori corso",{"$f":"IF(PAGINA_PRINCIPALE!C14=0,\"\",PAGINA_PRINCIPALE!C14)","v":"-"},null,null,null,null,null,{"$f":"PAGINA_PRINCIPALE!I14","v":"ERRORE - Indicare In corso / Fuori corso"}]
[null,null,"Compilare i campi sopra nella PAGINA_PRINCIPALE"]
[]
[null,null,null,null,null,null,null,null,null,null,null,"Sovran-\nnumero","Sovran-\nnumero"]
[null,"Insegnamenti obbligatori","Note","CFU","Scelta","Anno\nconsigliato","Anno\neffettivo","Semestre","Sovran-\nnumero","CFU\nsostenuti","CFU da\nsostenere","CFU\nsostenuti","CFU da\nsostenere","Verifica"]
["i1","Analisi Matematica I",null,12,"Da Sostenere",1,1,1,"-",{"$f":"IF(I19<>\"X\",IF(E19=\"Sostenuto\",D19,\"\"),\"\")","v":""},{"$f":"IF(I19<>\"X\",IF(E19=\"Da Sostenere\",D19,\"\"),\"\")","v":12},{"$f":"IF(I19=\"X\",IF(E19=\"Sostenuto\",D19,\"\"),\"\")","v":""},{"$f":"IF(I19=\"X\",IF(E19=\"Da Sostenere\",D19,\"\"),\"\")","v":""},{"$f":"IF(OR(AND(E19=\"NO\",G19<>\"-\"),AND(E19<>\"NO\",G19=\"-\")),\"ERRORE\",\"OK\")","v":"OK"}]
[{"$f":"\"i\"&VALUE(MID(A19,2,LEN(A19)-1))+1","v":"i2"},"Elementi di Economia e Organizzazione Aziendale",null,6,"Da Sostenere",1,1,1,"-",{"$f":"IF(I20<>\"X\",IF(E20=\"Sostenuto\",D20,\"\"),\"\")","v":""},{"$f":"IF(I20<>\"X\",IF(E20=\"Da Sostenere\",D20,\"\"),\"\")","v":6},{"$f":"IF(I20=\"X\",IF(E20=\"Sostenuto\",D20,\"\"),\"\")","v":""},{"$f":"IF(I20=\"X\",IF(E20=\"Da Sostenere\",D20,\"\"),\"\")","v":""},{"$f":"IF(OR(AND(E20=\"NO\",G20<>\"-\"),AND(E20<>\"NO\",G20=\"-\")),\"ERRORE\",\"OK\")","v":"OK"}]
[{"$f":"\"i\"&VALUE(MID(A20,2,LEN(A20)-1))+1","v":"i3"},"Fondamenti di Informatica",null,9,"Da Sostenere",1,1,1,"-","",9,"","","OK"]
["i4","Geometria e Algebra",null,9,"Da Sostenere",1,1,2,"-","",9,"","","OK"]
["i5","Fisica Generale I",null,12,"Da Sostenere",1,1,2,"-","",12,"","","OK"]
["i6","Programmazione Web",null,6,"Da Sostenere",1,1,2,"-",{"$f":"IF(I24<>\"X\",IF(E24=\"Sostenuto\",D24,\"\"),\"\")","v":""},{"$f":"IF(I24<>\"X\",IF(E24=\"Da Sostenere\",D24,\"\"),\"\")","v":6},{"$f":"IF(I24=\"X\",IF(E24=\"Sostenuto\",D24,\"\"),\"\")","v":""},{"$f":"IF(I24=\"X\",IF(E24=\"Da Sostenere\",D24,\"\"),\"\")","v":""},"OK"]
["i7","Analisi Matematica II",null,9,"Da Sostenere",2,2,1,"-","",9,"","","OK"]
["i8","Elettrotecnica",null,6,"Da Sostenere",2,2,1,"-","",6,"","","OK"]
["i9","Fisica Generale II",null,6,"Da Sostenere",2,2,1,"-","",6,"","","OK"]
["i10","Probabilità, Fenomeni Aleatori ed Analisi dei Dati - 9 CFU",null,9,"Da Sostenere",2,2,1,"-","",9,"","","OK"]
["i11","Fondamenti di Controlli","(1)",9,"NO",2,"-",2,"-","","","","",{"$f":"IF(OR(AND(E29=\"NO\",G29<>\"-\"),AND(E29<>\"NO\",G29=\"-\")),\"ERRORE\",\"OK\")","v":"OK"}]
["i12","Feedback Control Systems",{"$f":"C29","v":"(1)"},9,"NO",2,"-",2,"-","","","","","OK"]
["i13","Fondamenti di Elettronica",null,9,"Da Sostenere",2,2,2,"-","",9,"","","OK"]
["i14","Fondamenti di Telecomunicazioni - 9 CFU",null,9,"Da Sostenere",2,2,2,"-","",9,"","","OK"]
["i15","Campi Elettromagnetici",null,9,"Da Sostenere",3,3,1,"-","",9,"","","OK"]
["i16","Fondamenti di Internet",null,9,"Da Sostenere",3,3,1,"-","",9,"","","OK"]
["i17","Basi di Dati e Conoscenza",null,6,"Da Sostenere",3,3,1,"-","",6,"","","OK"]
["i18","Elaborazione Numerica dei Segnali",null,9,"Da Sostenere",3,3,2,"-","",9,"","","OK"]
["i19","Lingua straniera (Inglese)",null,6,"Da Sostenere",3,3,null,"-","",6,"","","OK"]
["i20","Attività formative",null,6,"Da Sostenere",3,3,null,"-","",6,"","","OK"]
["i21","Prova finale",null,6,"Da Sostenere",3,3,null,"-","",6,"","","OK"]
[null,null,null,null,null,null,null,null,null,{"$f":"SUM(J19:J39)","v":0},{"$f":"SUM(K19:K39)","v":153},{"$f":"SUM(L19:L39)","v":0},{"$f":"SUM(M19:M39)","v":0}]
[null,"Totale CFU insegnamenti obbligatori",null,{"$f":"SUM(J40:K40)","v":153},null,null,null,null,null,"Tot sosten.","Tot da sost.","Tot sosten.","Tot da sost."]
[null,"Totale CFU insegnamenti obbligatori sovrannumero",null,{"$f":"SUM(L40:M40)","v":0}]
[]
[{"$f":"C29","v":"(1)"},{"$f":"\"Scegliere uno tra \"&A29&\" e \"&A30","v":"Scegliere uno tra i11 e i12"},null,{"$f":"IF(_xlfn.XOR(OR(E29=\"Da Sostenere\",E29=\"Sostenuto\"),OR(E30=\"Da Sostenere\",E30=\"Sostenuto\")),\"OK\",\"ERRORE\")","v":"ERRORE"}]
[null,null,null,null,null,null,null,null,null,null,null,"Sovran-\nnumero","Sovran-\nnumero"]
[null,"Insegnamenti a scelta proposti",null,"CFU","Scelta","Anno\nconsigliato","Anno\neffettivo","Semestre","Sovran-\nnumero","CFU\nsostenuti","CFU da\nsostenere","CFU\nsostenuti","CFU da\nsostenere","Verifica"]
[{"$f":"\"i\"&VALUE(MID(A39,2,LEN(A39)-1))+1","v":"i22"},"-",null,{"$f":"LOOKUP(B47,scelte_1819!$A$2:$A$16, scelte_1819!$D$2:$D$16)","v":"-"},"NO",{"$f":"LOOKUP(B47,scelte_1819!$A$2:$A$16, scelte_1819!$B$2:$B$16)","v":"-"},"-",{"$f":"LOOKUP(B47,scelte_1819!$A$2:$A$16, scelte_1819!$C$2:$C$16)","v":"-"},"-",{"$f":"IF(I47<>\"X\",IF(E47=\"Sostenuto\",D47,\"\"),\"\")","v":""},{"$f":"IF(I47<>\"X\",IF(E47=\"Da Sostenere\",D47,\"\"),\"\")","v":""},{"$f":"IF(I47=\"X\",IF(E47=\"Sostenuto\",D47,\"\"),\"\")","v":""},{"$f":"IF(I47=\"X\",IF(E47=\"Da Sostenere\",D47,\"\"),\"\")","v":""},{"$f":"IF(OR(AND(B47<>\"-\",OR(E47=\"NO\",G47=\"-\")),AND(B47=\"-\",OR(E47<>\"NO\",G47<>\"-\"))),\"ERRORE\",\"OK\")","v":"OK"}]
[{"$f":"\"i\"&VALUE(MID(A47,2,LEN(A47)-1))+1","v":"i23"},"-",null,{"$f":"LOOKUP(B48,scelte_1819!$A$2:$A$16, scelte_1819!$D$2:$D$16)","v":"-"},"NO",{"$f":"LOOKUP(B48,scelte_1819!$A$2:$A$16, scelte_1819!$B$2:$B$16)","v":"-"},"-",{"$f":"LOOKUP(B48,scelte_1819!$A$2:$A$16, scelte_1819!$C$2:$C$16)","v":"-"},"-","","","","",{"$f":"IF(OR(AND(B48<>\"-\",OR(E48=\"NO\",G48=\"-\")),AND(B48=\"-\",OR(E48<>\"NO\",G48<>\"-\"))),\"ERRORE\",\"OK\")","v":"OK"}]
[{"$f":"\"i\"&VALUE(MID(A48,2,LEN(A48)-1))+1","v":"i24"},"-",null,{"$f":"LOOKUP(B49,scelte_1819!$A$2:$A$16, scelte_1819!$D$2:$D$16)","v":"-"},"NO",{"$f":"LOOKUP(B49,scelte_1819!$A$2:$A$16, scelte_1819!$B$2:$B$16)","v":"-"},"-",{"$f":"LOOKUP(B49,scelte_1819!$A$2:$A$16, scelte_1819!$C$2:$C$16)","v":"-"},"-","","","","","OK"]
["i25","-",null,{"$f":"LOOKUP(B50,scelte_1819!$A$2:$A$16, scelte_1819!$D$2:$D$16)","v":"-"},"NO",{"$f":"LOOKUP(B50,scelte_1819!$A$2:$A$16, scelte_1819!$B$2:$B$16)","v":"-"},"-",{"$f":"LOOKUP(B50,scelte_1819!$A$2:$A$16, scelte_1819!$C$2:$C$16)","v":"-"},"-","","","","","OK"]
["i26","-",null,{"$f":"LOOKUP(B51,scelte_1819!$A$2:$A$16, scelte_1819!$D$2:$D$16)","v":"-"},"NO",{"$f":"LOOKUP(B51,scelte_1819!$A$2:$A$16, scelte_1819!$B$2:$B$16)","v":"-"},"-",{"$f":"LOOKUP(B51,scelte_1819!$A$2:$A$16, scelte_1819!$C$2:$C$16)","v":"-"},"-","","","","","OK"]
["i27","-",null,{"$f":"LOOKUP(B52,scelte_1819!$A$2:$A$16, scelte_1819!$D$2:$D$16)","v":"-"},"NO",{"$f":"LOOKUP(B52,scelte_1819!$A$2:$A$16, scelte_1819!$B$2:$B$16)","v":"-"},"-",{"$f":"LOOKUP(B52,scelte_1819!$A$2:$A$16, scelte_1819!$C$2:$C$16)","v":"-"},"-","","","","","OK"]
[]
[null,null,null,null,null,null,null,null,null,null,null,"Sovran-\nnumero","Sovran-\nnumero"]
[null,"Insegnamenti a scelta libera",null,"CFU","Scelta","Anno\nconsigliato","Anno\neffettivo","Semestre","Sovran-\nnumero","CFU\nsostenuti","CFU da\nsostenere","CFU\nsostenuti","CFU da\nsostenere","Verifica"]
[{"$f":"\"i\"&VALUE(MID(A52,2,LEN(A52)-1))+1","v":"i28"},null,null,null,"NO",null,"-",null,"-",{"$f":"IF(I56<>\"X\",IF(E56=\"Sostenuto\",D56,\"\"),\"\")","v":""},{"$f":"IF(I56<>\"X\",IF(E56=\"Da Sostenere\",D56,\"\"),\"\")","v":""},{"$f":"IF(I56=\"X\",IF(E56=\"Sostenuto\",D56,\"\"),\"\")","v":""},{"$f":"IF(I56=\"X\",IF(E56=\"Da Sostenere\",D56,\"\"),\"\")","v":""},{"$f":"IF(OR(AND(B56<>\"\",OR(D56=\"\",E56=\"NO\",G56=\"-\")),AND(B56=\"\",OR(D56<>\"\",E56<>\"NO\",G56<>\"-\"))),\"ERRORE\",\"OK\")","v":"OK"}]
[{"$f":"\"i\"&VALUE(MID(A56,2,LEN(A56)-1))+1","v":"i29"},null,null,null,"NO",null,"-",null,"-","","","","",{"$f":"IF(OR(AND(B57<>\"\",OR(D57=\"\",E57=\"NO\",G57=\"-\")),AND(B57=\"\",OR(D57<>\"\",E57<>\"NO\",G57<>\"-\"))),\"ERRORE\",\"OK\")","v":"OK"}]
[{"$f":"\"i\"&VALUE(MID(A57,2,LEN(A57)-1))+1","v":"i30"},null,null,null,"NO",null,"-",null,"-","","","","","OK"]
["i31",null,null,null,"NO",null,"-",null,"-","","","","","OK"]
["i32",null,null,null,"NO",null,"-",null,"-","","","","","OK"]
["i33",null,null,null,"NO",null,"-",null,"-","","","","","OK"]
[null,null,null,null,null,null,null,null,null,{"$f":"SUM(J47:J61)","v":0},0,0,0]
[null,"Totale CFU insegnamenti a scelta",null,{"$f":"SUM(J62:K62)","v":0},null,null,null,null,null,"Tot sosten.","Tot da sost.","Tot sosten.","Tot da sost."]
[null,"Totale CFU insegnamenti a scelta in sovrannumero",null,{"$f":"SUM(L62:M62)","v":0}]
[]
[]
[null,"Totale generale",null,{"$f":"D41+D63","v":153}]
[null,"Totale generale in sovrannumero",null,{"$f":"D42+D64","v":0}]
[]
[null,"Totale generale crediti >= 180",null,{"$f":" IF(D67>=180,\"OK\", \"ERRORE: numero crediti < 180\")","v":"ERRORE: numero crediti < 180"}]
[null,"Totale generale crediti <= 183",null,{"$f":" IF(D67<=183,\"OK\", \"ERRORE: numero crediti > 183\")","v":"OK"}]
[]
[]
[null,"Controllo totale numero errori",null,{"$f":"COUNTIF(N19:N39,E74)+COUNTIF(D44:D44,E74)+COUNTIF(N47:N52,E74)+COUNTIF(N56:N61,E74)+COUNTIF(D70:E71,E74)","v":2},{"$f":"\"*\" & \"ERROR\" & \"*\"","v":"*ERROR*"}]
[null,"Risultato analisi del piano",null,{"$f":"IF(D74=0,\"IL PIANO NON CONTIENE ERRORI FORMALI\",\"IL PIANO CONTIENE DEGLI ERRORI FORMALI (\"&D74&\")\")","v":"IL PIANO CONTIENE DEGLI ERRORI FORMALI (2)"}]

{"sheet":"Gener_1920","index":4,"n_rows":80,"n_cols":14,"rows_kept":80,"cut":false,"hidden":false,"merged":[[7,8,7,11],[8,8,8,11],[1,1,1,11],[2,1,2,11],[9,8,9,11],[79,3,79,6],[7,2,7,6],[8,2,8,6],[9,2,9,6],[10,2,10,6],[11,2,11,6],[13,2,13,4],[14,2,14,6],[10,8,10,11],[11,8,11,11],[12,8,12,11],[13,8,13,11],[75,3,75,4]]}
[]
[null,"Corso di Laurea in Ingegneria di Internet - Piano di studi 2020/21"]
[null,"Modello Generico 2019/20"]
[null,"CFU Totali",{"$f":"D72","v":147},null,"CFU Mancanti",{"$f":"MAX(0,180-C4)","v":33}]
[null,"CFU Sovrannum.",{"$f":"D73","v":0},null,"Stato",{"$f":"D80","v":"IL PIANO CONTIENE DEGLI ERRORI FORMALI (3)"}]
[]
[]
[null,"Cognome Nome:",{"$f":"IF(PAGINA_PRINCIPALE!C8=0,\"\",PAGINA_PRINCIPALE!C8)","v":""},null,null,null,null,null,{"$f":"PAGINA_PRINCIPALE!I8","v":"ERRORE - Inserire Cognome Nome"}]
[null,"Matricola:",{"$f":"IF(PAGINA_PRINCIPALE!C9=0,\"\",PAGINA_PRINCIPALE!C9)","v":""},null,null,null,null,null,{"$f":"PAGINA_PRINCIPALE!I9","v":"ERRORE - Inserire Matricola"}]
[null,"Codice Fiscale",{"$f":"IF(PAGINA_PRINCIPALE!C10=0,\"\",PAGINA_PRINCIPALE!C10)","v":""},null,null,null,null,null,{"$f":"PAGINA_PRINCIPALE!I10","v":"ERRORE - Inserire Codice Fiscale"}]
[null,"E-mail:",{"$f":"IF(PAGINA_PRINCIPALE!C11=0,\"\",PAGINA_PRINCIPALE!C11)","v":""},null,null,null,null,null,{"$f":"PAGINA_PRINCIPALE!I11","v":"ERRORE - Inserire e-mail"}]
[null,"Telefono:",{"$f":"IF(PAGINA_PRINCIPALE!C12=0,\"\",PAGINA_PRINCIPALE!C12)","v":""},null,null,null,null,null,{"$f":"PAGINA_PRINCIPALE!I12","v":"ERRORE - Inserire Telefono"}]
[null,"Anno di Corso (I, II, III):",{"$f":"IF(PAGINA_PRINCIPALE!C13=0,\"\",PAGINA_PRINCIPALE!C13)","v":"-"},null,null,null,null,null,{"$f":"PAGINA_PRINCIPALE!I13","v":"ERRORE - Inserire Anno di Corso"}]
[null,"In corso/Fuori corso",{"$f":"IF(PAGINA_PRINCIPALE!C14=0,\"\",PAGINA_PRINCIPALE!C14)","v":"-"},null,null,null,null,null,{"$f":"PAGINA_PRINCIPALE!I14","v":"ERRORE - Indicare In corso / Fuori corso"}]
[null,null,"Compilare i campi sopra nella PAGINA_PRINCIPALE"]
[]
[null,null,null,null,null,null,null,null,null,null,null,"Sovran-\nnumero","Sovran-\nnumero"]
[null,"Insegnamenti obbligatori","Note","CFU","Scelta","Anno\nconsigliato","Anno\neffettivo","Semestre","Sovran-\nnumero","CFU\nsostenuti","CFU da\nsostenere","CFU\nsostenuti","CFU da\nsostenere","Verifica"]
["i1","Analisi Matematica I",null,12,"Da Sostenere",1,1,1,"-",{"$f":"IF(I19<>\"X\",IF(E19=\"Sostenuto\",D19,\"\"),\"\")","v":""},{"$f":"IF(I19<>\"X\",IF(E19=\"Da Sostenere\",D19,\"\"),\"\")","v":12},{"$f":"IF(I19=\"X\",IF(E19=\"Sostenuto\",D19,\"\"),\"\")","v":""},{"$f":"IF(I19=\"X\",IF(E19=\"Da Sostenere\",D19,\"\"),\"\")","v":""},{"$f":"IF(OR(AND(E19=\"NO\",G19<>\"-\"),AND(E19<>\"NO\",G19=\"-\")),\"ERRORE\",\"OK\")","v":"OK"}]
[{"$f":"\"i\"&VALUE(MID(A19,2,LEN(A19)-1))+1","v":"i2"},"Elementi di Economia e Organizzazione Aziendale",null,6,"Da Sostenere",1,1,1,"-",{"$f":"IF(I20<>\"X\",IF(E20=\"Sostenuto\",D20,\"\"),\"\")","v":""},{"$f":"IF(I20<>\"X\",IF(E20=\"Da Sostenere\",D20,\"\"),\"\")","v":6},{"$f":"IF(I20=\"X\",IF(E20=\"Sostenuto\",D20,\"\"),\"\")","v":""},{"$f":"IF(I20=\"X\",IF(E20=\"Da Sostenere\",D20,\"\"),\"\")","v":""},{"$f":"IF(OR(AND(E20=\"NO\",G20<>\"-\"),AND(E20<>\"NO\",G20=\"-\")),\"ERRORE\",\"OK\")","v":"OK"}]
[{"$f":"\"i\"&VALUE(MID(A20,2,LEN(A20)-1))+1","v":"i3"},"Fondamenti di Informatica",null,9,"Da Sostenere",1,1,1,"-","",9,"","","OK"]
["i4","Geometria e Algebra",null,9,"Da Sostenere",1,1,2,"-","",9,"","","OK"]
["i5","Fisica Generale I",null,12,"Da Sostenere",1,1,2,"-","",12,"","","OK"]
["i6","Sicurezza delle Infrastrutture ICT",{"$f":"C39","v":"(3)"},6,"NO",1,"-",2,"-","","","","","OK"]
["i7","Analisi Matematica II",null,9,"Da Sostenere",2,2,1,"-","",9,"","","OK"]
["i8","Elettrotecnica",null,6,"Da Sostenere",2,2,1,"-","",6,"","","OK"]
["i9","Fisica Generale II",null,6,"Da Sostenere",2,2,1,"-","",6,"","","OK"]
["i10","Probabilità, Fenomeni Aleatori ed Analisi dei Dati - 6 CFU","(1)",6,"Da Sostenere",2,2,1,"-","",6,"","","OK"]
["i11","Probabilità, Fenomeni Aleatori ed Analisi dei Dati - 9 CFU",{"$f":"C28","v":"(1)"},9,"NO",2,"-",1,"-","","","","","OK"]
["i12","Fondamenti di Controlli",{"$f":"\"(\"&VALUE(MID(C28,2,LEN(C28)-2))+1&\")\"","v":"(2)"},9,"NO",2,"-",2,"-","","","","",{"$f":"IF(OR(AND(E30=\"NO\",G30<>\"-\"),AND(E30<>\"NO\",G30=\"-\")),\"ERRORE\",\"OK\")","v":"OK"}]
["i13","Feedback Control Systems",{"$f":"C30","v":"(2)"},9,"NO",2,"-",2,"-","","","","","OK"]
["i14","Fondamenti di Elettronica",null,9,"Da Sostenere",2,2,2,"-","",9,"","","OK"]
["i15","Fondamenti di Telecomunicazioni - 6 CFU",null,6,"Da Sostenere",2,2,2,"-","",6,"","","OK"]
["i16","Campi Elettromagnetici",null,9,"Da Sostenere",3,3,1,"-","",9,"","","OK"]
["i17","Fondamenti di Internet",null,9,"Da Sostenere",3,3,1,"-","",9,"","","OK"]
["i18","Basi di Dati e Conoscenza",null,6,"Da Sostenere",3,3,1,"-","",6,"","","OK"]
["i19","Programmazione Web",null,6,"Da Sostenere",3,3,1,"-","",6,"","","OK"]
["i20","Elaborazione Numerica dei Segnali",null,9,"Da Sostenere",3,3,2,"-","",9,"","","OK"]
["i21","Internet delle Cose",{"$f":"\"(\"&VALUE(MID(C30,2,LEN(C30)-2))+1&\")\"","v":"(3)"},6,"NO",3,"-",2,"-","","","","","OK"]
["i22","Lingua straniera (Inglese)",null,6,"Da Sostenere",3,3,null,"-","",6,"","","OK"]
["i23","Attività formative",null,6,"Da Sostenere",3,3,null,"-","",6,"","","OK"]
["i24","Prova finale",null,6,"Da Sostenere",3,3,null,"-","",6,"","","OK"]
[null,null,null,null,null,null,null,null,null,{"$f":"SUM(J19:J42)","v":0},147,0,0]
[null,"Totale CFU insegnamenti obbligatori",null,{"$f":"SUM(J43:K43)","v":147},null,null,null,null,null,"Tot sosten.","Tot da sost.","Tot sosten.","Tot da sost."]
[null,"Totale CFU insegnamenti obbligatori sovrannumero",null,{"$f":"SUM(L43:M43)","v":0}]
[]
[{"$f":"C28","v":"(1)"},{"$f":"\"Scegliere uno tra \"&A28&\" e \"&A29","v":"Scegliere uno tra i10 e i11"},null,{"$f":"IF(_xlfn.XOR(OR(E28=\"Da Sostenere\",E28=\"Sostenuto\"),OR(E29=\"Da Sostenere\",E29=\"Sostenuto\")),\"OK\",\"ERRORE\")","v":"OK"}]
[{"$f":"C30","v":"(2)"},{"$f":"\"Scegliere uno tra \"&A30&\" e \"&A31","v":"Scegliere uno tra i12 e i13"},null,{"$f":"IF(_xlfn.XOR(OR(E30=\"Da Sostenere\",E30=\"Sostenuto\"),OR(E31=\"Da Sostenere\",E31=\"Sostenuto\")),\"OK\",\"ERRORE\")","v":"ERRORE"}]
[{"$f":"C39","v":"(3)"},{"$f":"\"Scegliere almeno uno tra \"&A24&\" e \"&A39","v":"Scegliere almeno uno tra i6 e i21"},null,{"$f":"IF(OR(OR(E24=\"Da Sostenere\",E24=\"Sostenuto\"),OR(E39=\"Da Sostenere\",E39=\"Sostenuto\")),\"OK\",\"ERRORE\")","v":"ERRORE"}]
[null,null,null,null,null,null,null,null,null,null,null,"Sovran-\nnumero","Sovran-\nnumero"]
[null,"Insegnamenti a scelta proposti",null,"CFU","Scelta","Anno\nconsigliato","Anno\neffettivo","Semestre","Sovran-\nnumero","CFU\nsostenuti","CFU da\nsostenere","CFU\nsostenuti","CFU da\nsostenere","Verifica"]
[{"$f":"\"i\"&VALUE(MID(A42,2,LEN(A42)-1))+1","v":"i25"},"-",null,{"$f":"LOOKUP(B52,scelte_1920!$A$2:$A$14, scelte_1920!$D$2:$D$14)","v":"-"},"NO",{"$f":"LOOKUP(B52,scelte_1920!$A$2:$A$14, scelte_1920!$B$2:$B$14)","v":"-"},"-",{"$f":"LOOKUP(B52,scelte_1920!$A$2:$A$14, scelte_1920!$C$2:$C$14)","v":"-"},"-",{"$f":"IF(I52<>\"X\",IF(E52=\"Sostenuto\",D52,\"\"),\"\")","v":""},{"$f":"IF(I52<>\"X\",IF(E52=\"Da Sostenere\",D52,\"\"),\"\")","v":""},{"$f":"IF(I52=\"X\",IF(E52=\"Sostenuto\",D52,\"\"),\"\")","v":""},{"$f":"IF(I52=\"X\",IF(E52=\"Da Sostenere\",D52,\"\"),\"\")","v":""},{"$f":"IF(OR(AND(B52<>\"-\",OR(E52=\"NO\",G52=\"-\")),AND(B52=\"-\",OR(E52<>\"NO\",G52<>\"-\"))),\"ERRORE\",\"OK\")","v":"OK"}]
[{"$f":"\"i\"&VALUE(MID(A52,2,LEN(A52)-1))+1","v":"i26"},"-",null,{"$f":"LOOKUP(B53,scelte_1920!$A$2:$A$14, scelte_1920!$D$2:$D$14)","v":"-"},"NO",{"$f":"LOOKUP(B53,scelte_1920!$A$2:$A$14, scelte_1920!$B$2:$B$14)","v":"-"},"-",{"$f":"LOOKUP(B53,scelte_1920!$A$2:$A$14, scelte_1920!$C$2:$C$14)","v":"-"},"-","","","","",{"$f":"IF(OR(AND(B53<>\"-\",OR(E53=\"NO\",G53=\"-\")),AND(B53=\"-\",OR(E53<>\"NO\",G53<>\"-\"))),\"ERRORE\",\"OK\")","v":"OK"}]
[{"$f":"\"i\"&VALUE(MID(A53,2,LEN(A53)-1))+1","v":"i27"},"-",null,{"$f":"LOOKUP(B54,scelte_1920!$A$2:$A$14, scelte_1920!$D$2:$D$14)","v":"-"},"NO",{"$f":"LOOKUP(B54,scelte_1920!$A$2:$A$14, scelte_1920!$B$2:$B$14)","v":"-"},"-",{"$f":"LOOKUP(B54,scelte_1920!$A$2:$A$14, scelte_1920!$C$2:$C$14)","v":"-"},"-","","","","","OK"]
["i28","-",null,{"$f":"LOOKUP(B55,scelte_1920!$A$2:$A$14, scelte_1920!$D$2:$D$14)","v":"-"},"NO",{"$f":"LOOKUP(B55,scelte_1920!$A$2:$A$14, scelte_1920!$B$2:$B$14)","v":"-"},"-",{"$f":"LOOKUP(B55,scelte_1920!$A$2:$A$14, scelte_1920!$C$2:$C$14)","v":"-"},"-","","","","","OK"]
["i29","-",null,{"$f":"LOOKUP(B56,scelte_1920!$A$2:$A$14, scelte_1920!$D$2:$D$14)","v":"-"},"NO",{"$f":"LOOKUP(B56,scelte_1920!$A$2:$A$14, scelte_1920!$B$2:$B$14)","v":"-"},"-",{"$f":"LOOKUP(B56,scelte_1920!$A$2:$A$14, scelte_1920!$C$2:$C$14)","v":"-"},"-","","","","","OK"]
["i30","-",null,{"$f":"LOOKUP(B57,scelte_1920!$A$2:$A$14, scelte_1920!$D$2:$D$14)","v":"-"},"NO",{"$f":"LOOKUP(B57,scelte_1920!$A$2:$A$14, scelte_1920!$B$2:$B$14)","v":"-"},"-",{"$f":"LOOKUP(B57,scelte_1920!$A$2:$A$14, scelte_1920!$C$2:$C$14)","v":"-"},"-","","","","","OK"]
[]
[null,null,null,null,null,null,null,null,null,null,null,"Sovran-\nnumero","Sovran-\nnumero"]
[null,"Insegnamenti a scelta libera",null,"CFU","Scelta","Anno\nconsigliato","Anno\neffettivo","Semestre","Sovran-\nnumero","CFU\nsostenuti","CFU da\nsostenere","CFU\nsostenuti","CFU da\nsostenere","Verifica"]
[{"$f":"\"i\"&VALUE(MID(A57,2,LEN(A57)-1))+1","v":"i31"},null,null,null,"NO",null,"-",null,"-",{"$f":"IF(I61<>\"X\",IF(E61=\"Sostenuto\",D61,\"\"),\"\")","v":""},{"$f":"IF(I61<>\"X\",IF(E61=\"Da Sostenere\",D61,\"\"),\"\")","v":""},{"$f":"IF(I61=\"X\",IF(E61=\"Sostenuto\",D61,\"\"),\"\")","v":""},{"$f":"IF(I61=\"X\",IF(E61=\"Da Sostenere\",D61,\"\"),\"\")","v":""},{"$f":"IF(OR(AND(B61<>\"\",OR(D61=\"\",E61=\"NO\",G61=\"-\")),AND(B61=\"\",OR(D61<>\"\",E61<>\"NO\",G61<>\"-\"))),\"ERRORE\",\"OK\")","v":"OK"}]
[{"$f":"\"i\"&VALUE(MID(A61,2,LEN(A61)-1))+1","v":"i32"},null,null,null,"NO",null,"-",null,"-","","","","",{"$f":"IF(OR(AND(B62<>\"\",OR(D62=\"\",E62=\"NO\",G62=\"-\")),AND(B62=\"\",OR(D62<>\"\",E62<>\"NO\",G62<>\"-\"))),\"ERRORE\",\"OK\")","v":"OK"}]
[{"$f":"\"i\"&VALUE(MID(A62,2,LEN(A62)-1))+1","v":"i33"},null,null,null,"NO",null,"-",null,"-","","","","","OK"]
["i34",null,null,null,"NO",null,"-",null,"-","","","","","OK"]
["i35",null,null,null,"NO",null,"-",null,"-","","","","","OK"]
["i36",null,null,null,"NO",null,"-",null,"-","","","","","OK"]
[null,null,null,null,null,null,null,null,null,{"$f":"SUM(J52:J66)","v":0},0,0,0]
[null,"Totale CFU insegnamenti a scelta",null,{"$f":"SUM(J67:K67)","v":0},null,null,null,null,null,"Tot sosten.","Tot da sost.","Tot sosten.","Tot da sost."]
[null,"Totale CFU insegnamenti a scelta in sovrannumero",null,{"$f":"SUM(L67:M67)","v":0}]
[]
[]
[null,"Totale generale",null,{"$f":"D44+D68","v":147}]
[null,"Totale generale in sovrannumero",null,{"$f":"D45+D69","v":0}]
[]
[null,"Totale generale crediti >= 180",null,{"$f":" IF(D72>=180,\"OK\", \"ERRORE: numero crediti < 180\")","v":"ERRORE: numero crediti < 180"}]
[null,"Totale generale crediti <= 183",null,{"$f":" IF(D72<=183,\"OK\", \"ERRORE: numero crediti > 183\")","v":"OK"}]
[]
[]
[null,"Controllo totale numero errori",null,{"$f":"COUNTIF(N19:N42,E79)+COUNTIF(D47:D49,E79)+COUNTIF(N52:N57,E79)+COUNTIF(N61:N66,E79)+COUNTIF(D75:E76,E79)","v":3},{"$f":"\"*\" & \"ERROR\" & \"*\"","v":"*ERROR*"}]
[null,"Risultato analisi del piano",null,{"$f":"IF(D79=0,\"IL PIANO NON CONTIENE ERRORI FORMALI\",\"IL PIANO CONTIENE DEGLI ERRORI FORMALI (\"&D79&\")\")","v":"IL PIANO CONTIENE DEGLI ERRORI FORMALI (3)"}]

{"sheet":"Cybersec_1920","index":5,"n_rows":82,"n_cols":14,"rows_kept":82,"cut":false,"hidden":false,"merged":[[77,3,77,4],[81,3,81,6],[10,2,10,6],[10,8,10,11],[11,2,11,6],[11,8,11,11],[12,8,12,11],[13,2,13,4],[13,8,13,11],[14,2,14,6],[9,2,9,6],[9,8,9,11],[1,1,1,11],[2,1,2,11],[7,2,7,6],[8,2,8,6],[8,8,8,11],[7,8,7,11]]}
[]
[null,"Corso di Laurea in Ingegneria di Internet - Piano di studi 2020/21"]
[null,"Percorso \"Cybersecurity Track\" 2019/20"]
[null,"CFU Totali",{"$f":"D74","v":165},null,"CFU Mancanti",{"$f":"MAX(0,180-C4)","v":15}]
[null,"CFU Sovrannum.",{"$f":"D75","v":0},null,"Stato",{"$f":"D82","v":"IL PIANO CONTIENE DEGLI ERRORI FORMALI (2)"}]
[]
[]
[null,"Cognome Nome:",{"$f":"IF(PAGINA_PRINCIPALE!C8=0,\"\",PAGINA_PRINCIPALE!C8)","v":""},null,null,null,null,null,{"$f":"PAGINA_PRINCIPALE!I8","v":"ERRORE - Inserire Cognome Nome"}]
[null,"Matricola:",{"$f":"IF(PAGINA_PRINCIPALE!C9=0,\"\",PAGINA_PRINCIPALE!C9)","v":""},null,null,null,null,null,{"$f":"PAGINA_PRINCIPALE!I9","v":"ERRORE - Inserire Matricola"}]
[null,"Codice Fiscale",{"$f":"IF(PAGINA_PRINCIPALE!C10=0,\"\",PAGINA_PRINCIPALE!C10)","v":""},null,null,null,null,null,{"$f":"PAGINA_PRINCIPALE!I10","v":"ERRORE - Inserire Codice Fiscale"}]
[null,"E-mail:",{"$f":"IF(PAGINA_PRINCIPALE!C11=0,\"\",PAGINA_PRINCIPALE!C11)","v":""},null,null,null,null,null,{"$f":"PAGINA_PRINCIPALE!I11","v":"ERRORE - Inserire e-mail"}]
[null,"Telefono:",{"$f":"IF(PAGINA_PRINCIPALE!C12=0,\"\",PAGINA_PRINCIPALE!C12)","v":""},null,null,null,null,null,{"$f":"PAGINA_PRINCIPALE!I12","v":"ERRORE - Inserire Telefono"}]
[null,"Anno di Corso (I, II, III):",{"$f":"IF(PAGINA_PRINCIPALE!C13=0,\"\",PAGINA_PRINCIPALE!C13)","v":"-"},null,null,null,null,null,{"$f":"PAGINA_PRINCIPALE!I13","v":"ERRORE - Inserire Anno di Corso"}]
[null,"In corso/Fuori corso",{"$f":"IF(PAGINA_PRINCIPALE!C14=0,\"\",PAGINA_PRINCIPALE!C14)","v":"-"},null,null,null,null,null,{"$f":"PAGINA_PRINCIPALE!I14","v":"ERRORE - Indicare In corso / Fuori corso"}]
[null,null,"Compilare i campi sopra nella PAGINA_PRINCIPALE"]
[]
[null,null,null,null,null,null,null,null,null,null,null,"Sovran-\nnumero","Sovran-\nnumero"]
[null,"Insegnamenti obbligatori","Note","CFU","Scelta","Anno\nconsigliato","Anno\neffettivo","Semestre","Sovran-\nnumero","CFU\nsostenuti","CFU da\nsostenere","CFU\nsostenuti","CFU da\nsostenere","Verifica"]
["i1","Analisi Matematica I",null,12,"Da Sostenere",1,1,1,"-",{"$f":"IF(I19<>\"X\",IF(E19=\"Sostenuto\",D19,\"\"),\"\")","v":""},{"$f":"IF(I19<>\"X\",IF(E19=\"Da Sostenere\",D19,\"\"),\"\")","v":12},{"$f":"IF(I19=\"X\",IF(E19=\"Sostenuto\",D19,\"\"),\"\")","v":""},{"$f":"IF(I19=\"X\",IF(E19=\"Da Sostenere\",D19,\"\"),\"\")","v":""},{"$f":"IF(OR(AND(E19=\"NO\",G19<>\"-\"),AND(E19<>\"NO\",G19=\"-\")),\"ERRORE\",\"OK\")","v":"OK"}]
[{"$f":"\"i\"&VALUE(MID(A19,2,LEN(A19)-1))+1","v":"i2"},"Elementi di Economia e Organizzazione Aziendale",null,6,"Da Sostenere",1,1,1,"-",{"$f":"IF(I20<>\"X\",IF(E20=\"Sostenuto\",D20,\"\"),\"\")","v":""},{"$f":"IF(I20<>\"X\",IF(E20=\"Da Sostenere\",D20,\"\"),\"\")","v":6},{"$f":"IF(I20=\"X\",IF(E20=\"Sostenuto\",D20,\"\"),\"\")","v":""},{"$f":"IF(I20=\"X\",IF(E20=\"Da Sostenere\",D20,\"\"),\"\")","v":""},{"$f":"IF(OR(AND(E20=\"NO\",G20<>\"-\"),AND(E20<>\"NO\",G20=\"-\")),\"ERRORE\",\"OK\")","v":"OK"}]
[{"$f":"\"i\"&VALUE(MID(A20,2,LEN(A20)-1))+1","v":"i3"},"Fondamenti di Informatica",null,9,"Da Sostenere",1,1,1,"-","",9,"","","OK"]
["i4","Geometria e Algebra",null,9,"Da Sostenere",1,1,2,"-","",9,"","","OK"]
["i5","Fisica Generale I",null,12,"Da Sostenere",1,1,2,"-","",12,"","","OK"]
["i6","Sicurezza delle Infrastrutture ICT",{"$f":"\"(\"&VALUE(MID(C30,2,LEN(C30)-2))+1&\")\"","v":"(3)"},6,"Da Sostenere",1,1,2,"-","",6,"","","OK"]
["i7","Analisi Matematica II",null,9,"Da Sostenere",2,2,1,"-","",9,"","","OK"]
["i8","Elettrotecnica",null,6,"Da Sostenere",2,2,1,"-","",6,"","","OK"]
["i9","Fisica Generale II",null,6,"Da Sostenere",2,2,1,"-","",6,"","","OK"]
["i10","Probabilità, Fenomeni Aleatori ed Analisi dei Dati - 6 CFU","(1)",6,"Da Sostenere",2,2,1,"-","",6,"","","OK"]
["i11","Probabilità, Fenomeni Aleatori ed Analisi dei Dati - 9 CFU",{"$f":"C28","v":"(1)"},9,"NO",2,"-",1,"-","","","","","OK"]
["i12","Fondamenti di Controlli",{"$f":"\"(\"&VALUE(MID(C28,2,LEN(C28)-2))+1&\")\"","v":"(2)"},9,"NO",2,"-",2,"-","","","","",{"$f":"IF(OR(AND(E30=\"NO\",G30<>\"-\"),AND(E30<>\"NO\",G30=\"-\")),\"ERRORE\",\"OK\")","v":"OK"}]
["i13","Feedback Control Systems",{"$f":"C30","v":"(2)"},9,"NO",2,"-",2,"-","","","","","OK"]
["i14","Fondamenti di Elettronica",null,9,"Da Sostenere",2,2,2,"-","",9,"","","OK"]
["i15","Fondamenti di Telecomunicazioni",null,6,"Da Sostenere",2,2,2,"-","",6,"","","OK"]
["i16","Campi Elettromagnetici",null,9,"Da Sostenere",3,3,1,"-","",9,"","","OK"]
["i17","Fondamenti di Internet",null,9,"Da Sostenere",3,3,1,"-","",9,"","","OK"]
["i18","Basi di Dati e Conoscenza",null,6,"Da Sostenere",3,3,1,"-","",6,"","","OK"]
["i19","Programmazione Web",null,6,"Da Sostenere",3,3,1,"-","",6,"","","OK"]
["i20","Elaborazione Numerica dei Segnali",null,9,"Da Sostenere",3,3,2,"-","",9,"","","OK"]
["i21","Internet delle Cose",{"$f":"C24","v":"(3)"},6,"NO",3,"-",2,"-","","","","","OK"]
["i22","Lingua straniera (Inglese)",null,6,"Da Sostenere",3,3,null,"-","",6,"","","OK"]
["i23","Attività formative",null,6,"Da Sostenere",3,3,null,"-","",6,"","","OK"]
["i24","Prova finale",null,6,"Da Sostenere",3,3,null,"-","",6,"","","OK"]
[null,null,null,null,null,null,null,null,null,{"$f":"SUM(J19:J42)","v":0},153,0,0]
[null,"Totale CFU insegnamenti obbligatori",null,{"$f":"SUM(J43:K43)","v":153},null,null,null,null,null,"Tot sosten.","Tot da sost.","Tot sosten.","Tot da sost."]
[null,"Totale CFU insegnamenti obbligatori sovrannumero",null,{"$f":"SUM(L43:M43)","v":0}]
[]
[{"$f":"C28","v":"(1)"},{"$f":"\"Scegliere uno tra \"&A28&\" e \"&A29","v":"Scegliere uno tra i10 e i11"},null,{"$f":"IF(_xlfn.XOR(OR(E28=\"Da Sostenere\",E28=\"Sostenuto\"),OR(E29=\"Da Sostenere\",E29=\"Sostenuto\")),\"OK\",\"ERRORE\")","v":"OK"}]
[{"$f":"C30","v":"(2)"},{"$f":"\"Scegliere uno tra \"&A30&\" e \"&A31","v":"Scegliere uno tra i12 e i13"},null,{"$f":"IF(_xlfn.XOR(OR(E30=\"Da Sostenere\",E30=\"Sostenuto\"),OR(E31=\"Da Sostenere\",E31=\"Sostenuto\")),\"OK\",\"ERRORE\")","v":"ERRORE"}]
[{"$f":"C24","v":"(3)"},{"$f":"\"Scegliere \"&A24&\", a scelta aggiungere \"&A39","v":"Scegliere i6, a scelta aggiungere i21"},null,{"$f":"IF(OR(E24=\"Da Sostenere\",E24=\"Sostenuto\"),\"OK\",\"ERRORE\")","v":"OK"}]
[null,null,null,null,null,null,null,null,null,null,null,"Sovran-\nnumero","Sovran-\nnumero"]
[null,"Insegnamenti a scelta proposti",null,"CFU","Scelta","Anno\nconsigliato","Anno\neffettivo","Semestre","Sovran-\nnumero","CFU\nsostenuti","CFU da\nsostenere","CFU\nsostenuti","CFU da\nsostenere","Verifica"]
[{"$f":"\"i\"&VALUE(MID(A42,2,LEN(A42)-1))+1","v":"i25"},"Sistemi Operativi",null,{"$f":"LOOKUP(B52,scelte_1920!$A$2:$A$14, scelte_1920!$D$2:$D$14)","v":6},"Da Sostenere",{"$f":"LOOKUP(B52,scelte_1920!$A$2:$A$14, scelte_1920!$B$2:$B$14)","v":2},2,{"$f":"LOOKUP(B52,scelte_1920!$A$2:$A$14, scelte_1920!$C$2:$C$14)","v":1},"-",{"$f":"IF(I52<>\"X\",IF(E52=\"Sostenuto\",D52,\"\"),\"\")","v":""},{"$f":"IF(I52<>\"X\",IF(E52=\"Da Sostenere\",D52,\"\"),\"\")","v":6},{"$f":"IF(I52=\"X\",IF(E52=\"Sostenuto\",D52,\"\"),\"\")","v":""},{"$f":"IF(I52=\"X\",IF(E52=\"Da Sostenere\",D52,\"\"),\"\")","v":""},{"$f":"IF(OR(AND(B52<>\"-\",OR(E52=\"NO\",G52=\"-\")),AND(B52=\"-\",OR(E52<>\"NO\",G52<>\"-\"))),\"ERRORE\",\"OK\")","v":"OK"}]
[{"$f":"\"i\"&VALUE(MID(A52,2,LEN(A52)-1))+1","v":"i26"},"Vulnerabilità e Difesa dei Sistemi Internet",null,{"$f":"LOOKUP(B53,scelte_1920!$A$2:$A$14, scelte_1920!$D$2:$D$14)","v":6},"Da Sostenere",{"$f":"LOOKUP(B53,scelte_1920!$A$2:$A$14, scelte_1920!$B$2:$B$14)","v":3},3,{"$f":"LOOKUP(B53,scelte_1920!$A$2:$A$14, scelte_1920!$C$2:$C$14)","v":2},"-","",6,"","",{"$f":"IF(OR(AND(B53<>\"-\",OR(E53=\"NO\",G53=\"-\")),AND(B53=\"-\",OR(E53<>\"NO\",G53<>\"-\"))),\"ERRORE\",\"OK\")","v":"OK"}]
[{"$f":"\"i\"&VALUE(MID(A53,2,LEN(A53)-1))+1","v":"i27"},"-",null,{"$f":"LOOKUP(B54,scelte_1920!$A$2:$A$14, scelte_1920!$D$2:$D$14)","v":"-"},"NO",{"$f":"LOOKUP(B54,scelte_1920!$A$2:$A$14, scelte_1920!$B$2:$B$14)","v":"-"},"-",{"$f":"LOOKUP(B54,scelte_1920!$A$2:$A$14, scelte_1920!$C$2:$C$14)","v":"-"},"-","","","","","OK"]
["i28","-",null,{"$f":"LOOKUP(B55,scelte_1920!$A$2:$A$14, scelte_1920!$D$2:$D$14)","v":"-"},"NO",{"$f":"LOOKUP(B55,scelte_1920!$A$2:$A$14, scelte_1920!$B$2:$B$14)","v":"-"},"-",{"$f":"LOOKUP(B55,scelte_1920!$A$2:$A$14, scelte_1920!$C$2:$C$14)","v":"-"},"-","","","","","OK"]
["i29","-",null,{"$f":"LOOKUP(B56,scelte_1920!$A$2:$A$14, scelte_1920!$D$2:$D$14)","v":"-"},"NO",{"$f":"LOOKUP(B56,scelte_1920!$A$2:$A$14, scelte_1920!$B$2:$B$14)","v":"-"},"-",{"$f":"LOOKUP(B56,scelte_1920!$A$2:$A$14, scelte_1920!$C$2:$C$14)","v":"-"},"-","","","","","OK"]
["i30","-",null,{"$f":"LOOKUP(B57,scelte_1920!$A$2:$A$14, scelte_1920!$D$2:$D$14)","v":"-"},"NO",{"$f":"LOOKUP(B57,scelte_1920!$A$2:$A$14, scelte_1920!$B$2:$B$14)","v":"-"},"-",{"$f":"LOOKUP(B57,scelte_1920!$A$2:$A$14, scelte_1920!$C$2:$C$14)","v":"-"},"-","","","","","OK"]
[]
[null,{"$f":"\"Scegliere \"&A52","v":"Scegliere i25"},null,{"$f":"IF(OR(E52=\"Da Sostenere\",E34=\"Sostenuto\"),\"OK\",\"ERRORE\")","v":"OK"}]
[null,{"$f":"\"Scegliere \"&A53","v":"Scegliere i26"},null,{"$f":"IF(OR(E53=\"Da Sostenere\",E35=\"Sostenuto\"),\"OK\",\"ERRORE\")","v":"OK"}]
[null,null,null,null,null,null,null,null,null,null,null,"Sovran-\nnumero","Sovran-\nnumero"]
[null,"Insegnamenti a scelta libera",null,"CFU","Scelta","Anno\nconsigliato","Anno\neffettivo","Semestre","Sovran-\nnumero","CFU\nsostenuti","CFU da\nsostenere","CFU\nsostenuti","CFU da\nsostenere","Verifica"]
[{"$f":"\"i\"&VALUE(MID(A57,2,LEN(A57)-1))+1","v":"i31"},null,null,null,"NO",null,"-",null,"-",{"$f":"IF(I63<>\"X\",IF(E63=\"Sostenuto\",D63,\"\"),\"\")","v":""},{"$f":"IF(I63<>\"X\",IF(E63=\"Da Sostenere\",D63,\"\"),\"\")","v":""},{"$f":"IF(I63=\"X\",IF(E63=\"Sostenuto\",D63,\"\"),\"\")","v":""},{"$f":"IF(I63=\"X\",IF(E63=\"Da Sostenere\",D63,\"\"),\"\")","v":""},{"$f":"IF(OR(AND(B63<>\"\",OR(D63=\"\",E63=\"NO\",G63=\"-\")),AND(B63=\"\",OR(D63<>\"\",E63<>\"NO\",G63<>\"-\"))),\"ERRORE\",\"OK\")","v":"OK"}]
[{"$f":"\"i\"&VALUE(MID(A63,2,LEN(A63)-1))+1","v":"i32"},null,null,null,"NO",null,"-",null,"-","","","","",{"$f":"IF(OR(AND(B64<>\"\",OR(D64=\"\",E64=\"NO\",G64=\"-\")),AND(B64=\"\",OR(D64<>\"\",E64<>\"NO\",G64<>\"-\"))),\"ERRORE\",\"OK\")","v":"OK"}]
[{"$f":"\"i\"&VALUE(MID(A64,2,LEN(A64)-1))+1","v":"i33"},null,null,null,"NO",null,"-",null,"-","","","","","OK"]
["i34",null,null,null,"NO",null,"-",null,"-","","","","","OK"]
["i35",null,null,null,"NO",null,"-",null,"-","","","","","OK"]
["i36",null,null,null,"NO",null,"-",null,"-","","","","","OK"]
[null,null,null,null,null,null,null,null,null,{"$f":"SUM(J52:J68)","v":0},12,0,0]
[null,"Totale CFU insegnamenti a scelta",null,{"$f":"SUM(J69:K69)","v":12},null,null,null,null,null,"Tot sosten.","Tot da sost.","Tot sosten.","Tot da sost."]
[null,"Totale CFU insegnamenti a scelta in sovrannumero",null,{"$f":"SUM(L69:M69)","v":0}]
[]
[]
[null,"Totale generale",null,{"$f":"D44+D70","v":165}]
[null,"Totale generale in sovrannumero",null,{"$f":"D45+D71","v":0}]
[]
[null,"Totale generale crediti >= 180",null,{"$f":" IF(D74>=180,\"OK\", \"ERRORE: numero crediti < 180\")","v":"ERRORE: numero crediti < 180"}]
[null,"Totale generale crediti <= 183",null,{"$f":" IF(D74<=183,\"OK\", \"ERRORE: numero crediti > 183\")","v":"OK"}]
[]
[]
[null,"Controllo totale numero errori",null,{"$f":"COUNTIF(N19:N42,E81)+COUNTIF(D47:D49,E81)+COUNTIF(N52:N57,E81)+COUNTIF(N63:N68,E81)+COUNTIF(D77:E78,E81)+COUNTIF(D59:D60,E81)","v":2},{"$f":"\"*\" & \"ERROR\" & \"*\"","v":"*ERROR*"}]
[null,"Risultato analisi del piano",null,{"$f":"IF(D81=0,\"IL PIANO NON CONTIENE ERRORI FORMALI\",\"IL PIANO CONTIENE DEGLI ERRORI FORMALI (\"&D81&\")\")","v":"IL PIANO CONTIENE DEGLI ERRORI FORMALI (2)"}]

{"sheet":"IoT_1920","index":6,"n_rows":82,"n_cols":14,"rows_kept":82,"cut":false,"hidden":false,"merged":[[77,3,77,4],[81,3,81,6],[10,2,10,6],[10,8,10,11],[11,2,11,6],[11,8,11,11],[12,8,12,11],[13,2,13,4],[13,8,13,11],[14,2,14,6],[9,2,9,6],[9,8,9,11],[1,1,1,11],[2,1,2,11],[7,2,7,6],[8,2,8,6],[8,8,8,11],[7,8,7,11]]}
[]
[null,"Corso di Laurea in Ingegneria di Internet - Piano di studi 2020/21"]
[null,"Percorso \"Internet of Things Track\" 2019/20"]
[null,"CFU Totali",{"$f":"D74","v":165},null,"CFU Mancanti",{"$f":"MAX(0,180-C4)","v":15}]
[null,"CFU Sovrannum.",{"$f":"D75","v":0},null,"Stato",{"$f":"D82","v":"IL PIANO CONTIENE DEGLI ERRORI FORMALI (2)"}]
[]
[]
[null,"Cognome Nome:",{"$f":"IF(PAGINA_PRINCIPALE!C8=0,\"\",PAGINA_PRINCIPALE!C8)","v":""},null,null,null,null,null,{"$f":"PAGINA_PRINCIPALE!I8","v":"ERRORE - Inserire Cognome Nome"}]
[null,"Matricola:",{"$f":"IF(PAGINA_PRINCIPALE!C9=0,\"\",PAGINA_PRINCIPALE!C9)","v":""},null,null,null,null,null,{"$f":"PAGINA_PRINCIPALE!I9","v":"ERRORE - Inserire Matricola"}]
[null,"Codice Fiscale",{"$f":"IF(PAGINA_PRINCIPALE!C10=0,\"\",PAGINA_PRINCIPALE!C10)","v":""},null,null,null,null,null,{"$f":"PAGINA_PRINCIPALE!I10","v":"ERRORE - Inserire Codice Fiscale"}]
[null,"E-mail:",{"$f":"IF(PAGINA_PRINCIPALE!C11=0,\"\",PAGINA_PRINCIPALE!C11)","v":""},null,null,null,null,null,{"$f":"PAGINA_PRINCIPALE!I11","v":"ERRORE - Inserire e-mail"}]
[null,"Telefono:",{"$f":"IF(PAGINA_PRINCIPALE!C12=0,\"\",PAGINA_PRINCIPALE!C12)","v":""},null,null,null,null,null,{"$f":"PAGINA_PRINCIPALE!I12","v":"ERRORE - Inserire Telefono"}]
[null,"Anno di Corso (I, II, III):",{"$f":"IF(PAGINA_PRINCIPALE!C13=0,\"\",PAGINA_PRINCIPALE!C13)","v":"-"},null,null,null,null,null,{"$f":"PAGINA_PRINCIPALE!I13","v":"ERRORE - Inserire Anno di Corso"}]
[null,"In corso/Fuori corso",{"$f":"IF(PAGINA_PRINCIPALE!C14=0,\"\",PAGINA_PRINCIPALE!C14)","v":"-"},null,null,null,null,null,{"$f":"PAGINA_PRINCIPALE!I14","v":"ERRORE - Indicare In corso / Fuori corso"}]
[null,null,"Compilare i campi sopra nella PAGINA_PRINCIPALE"]
[]
[null,null,null,null,null,null,null,null,null,null,null,"Sovran-\nnumero","Sovran-\nnumero"]
[null,"Insegnamenti obbligatori","Note","CFU","Scelta","Anno\nconsigliato","Anno\neffettivo","Semestre","Sovran-\nnumero","CFU\nsostenuti","CFU da\nsostenere","CFU\nsostenuti","CFU da\nsostenere","Verifica"]
["i1","Analisi Matematica I",null,12,"Da Sostenere",1,1,1,"-",{"$f":"IF(I19<>\"X\",IF(E19=\"Sostenuto\",D19,\"\"),\"\")","v":""},{"$f":"IF(I19<>\"X\",IF(E19=\"Da Sostenere\",D19,\"\"),\"\")","v":12},{"$f":"IF(I19=\"X\",IF(E19=\"Sostenuto\",D19,\"\"),\"\")","v":""},{"$f":"IF(I19=\"X\",IF(E19=\"Da Sostenere\",D19,\"\"),\"\")","v":""},{"$f":"IF(OR(AND(E19=\"NO\",G19<>\"-\"),AND(E19<>\"NO\",G19=\"-\")),\"ERRORE\",\"OK\")","v":"OK"}]
[{"$f":"\"i\"&VALUE(MID(A19,2,LEN(A19)-1))+1","v":"i2"},"Elementi di Economia e Organizzazione Aziendale",null,6,"Da Sostenere",1,1,1,"-",{"$f":"IF(I20<>\"X\",IF(E20=\"Sostenuto\",D20,\"\"),\"\")","v":""},{"$f":"IF(I20<>\"X\",IF(E20=\"Da Sostenere\",D20,\"\"),\"\")","v":6},{"$f":"IF(I20=\"X\",IF(E20=\"Sostenuto\",D20,\"\"),\"\")","v":""},{"$f":"IF(I20=\"X\",IF(E20=\"Da Sostenere\",D20,\"\"),\"\")","v":""},{"$f":"IF(OR(AND(E20=\"NO\",G20<>\"-\"),AND(E20<>\"NO\",G20=\"-\")),\"ERRORE\",\"OK\")","v":"OK"}]
[{"$f":"\"i\"&VALUE(MID(A20,2,LEN(A20)-1))+1","v":"i3"},"Fondamenti di Informatica",null,9,"Da Sostenere",1,1,1,"-","",9,"","","OK"]
["i4","Geometria e Algebra",null,9,"Da Sostenere",1,1,2,"-","",9,"","","OK"]
["i5","Fisica Generale I",null,12,"Da Sostenere",1,1,2,"-","",12,"","","OK"]
["i6","Sicurezza delle Infrastrutture ICT",null,6,"NO",1,"-",2,"-","","","","","OK"]
["i7","Analisi Matematica II",null,9,"Da Sostenere",2,2,1,"-","",9,"","","OK"]
["i8","Elettrotecnica",null,6,"Da Sostenere",2,2,1,"-","",6,"","","OK"]
["i9","Fisica Generale II",null,6,"Da Sostenere",2,2,1,"-","",6,"","","OK"]
["i10","Probabilità, Fenomeni Aleatori ed Analisi dei Dati - 6 CFU","(1)",6,"Da Sostenere",2,2,1,"-","",6,"","","OK"]
["i11","Probabilità, Fenomeni Aleatori ed Analisi dei Dati - 9 CFU",{"$f":"C28","v":"(1)"},9,"NO",2,"-",1,"-","","","","","OK"]
["i12","Fondamenti di Controlli",{"$f":"\"(\"&VALUE(MID(C28,2,LEN(C28)-2))+1&\")\"","v":"(2)"},9,"NO",2,"-",2,"-","","","","",{"$f":"IF(OR(AND(E30=\"NO\",G30<>\"-\"),AND(E30<>\"NO\",G30=\"-\")),\"ERRORE\",\"OK\")","v":"OK"}]
["i13","Feedback Control Systems",{"$f":"C30","v":"(2)"},9,"NO",2,"-",2,"-","","","","","OK"]
["i14","Fondamenti di Elettronica",null,9,"Da Sostenere",2,2,2,"-","",9,"","","OK"]
["i15","Fondamenti di Telecomunicazioni",null,6,"Da Sostenere",2,2,2,"-","",6,"","","OK"]
["i16","Campi Elettromagnetici",null,9,"Da Sostenere",3,3,1,"-","",9,"","","OK"]
["i17","Fondamenti di Internet",null,9,"Da Sostenere",3,3,1,"-","",9,"","","OK"]
["i18","Basi di Dati e Conoscenza",null,6,"Da Sostenere",3,3,1,"-","",6,"","","OK"]
["i19","Programmazione Web",null,6,"Da Sostenere",3,3,1,"-","",6,"","","OK"]
["i20","Elaborazione Numerica dei Segnali",null,9,"Da Sostenere",3,3,2,"-","",9,"","","OK"]
["i21","Internet delle Cose",{"$f":"\"(\"&VALUE(MID(C30,2,LEN(C30)-2))+1&\")\"","v":"(3)"},6,"Da Sostenere",3,3,2,"-","",6,"","","OK"]
["i22","Lingua straniera (Inglese)",null,6,"Da Sostenere",3,3,null,"-","",6,"","","OK"]
["i23","Attività formative",null,6,"Da Sostenere",3,3,null,"-","",6,"","","OK"]
["i24","Prova finale",null,6,"Da Sostenere",3,3,null,"-","",6,"","","OK"]
[null,null,null,null,null,null,null,null,null,{"$f":"SUM(J19:J42)","v":0},153,0,0]
[null,"Totale CFU insegnamenti obbligatori",null,{"$f":"SUM(J43:K43)","v":153},null,null,null,null,null,"Tot sosten.","Tot da sost.","Tot sosten.","Tot da sost."]
[null,"Totale CFU insegnamenti obbligatori sovrannumero",null,{"$f":"SUM(L43:M43)","v":0}]
[]
[{"$f":"C28","v":"(1)"},{"$f":"\"Scegliere uno tra \"&A28&\" e \"&A29","v":"Scegliere uno tra i10 e i11"},null,{"$f":"IF(_xlfn.XOR(OR(E28=\"Da Sostenere\",E28=\"Sostenuto\"),OR(E29=\"Da Sostenere\",E29=\"Sostenuto\")),\"OK\",\"ERRORE\")","v":"OK"}]
[{"$f":"C30","v":"(2)"},{"$f":"\"Scegliere uno tra \"&A30&\" e \"&A31","v":"Scegliere uno tra i12 e i13"},null,{"$f":"IF(_xlfn.XOR(OR(E30=\"Da Sostenere\",E30=\"Sostenuto\"),OR(E31=\"Da Sostenere\",E31=\"Sostenuto\")),\"OK\",\"ERRORE\")","v":"ERRORE"}]
[{"$f":"C39","v":"(3)"},{"$f":"\"Scegliere \"&A39&\", a scelta aggiungere \"&A24","v":"Scegliere i21, a scelta aggiungere i6"},null,{"$f":"IF(OR(E39=\"Da Sostenere\",E39=\"Sostenuto\"),\"OK\",\"ERRORE\")","v":"OK"}]
[null,null,null,null,null,null,null,null,null,null,null,"Sovran-\nnumero","Sovran-\nnumero"]
[null,"Insegnamenti a scelta proposti",null,"CFU","Scelta","Anno\nconsigliato","Anno\neffettivo","Semestre","Sovran-\nnumero","CFU\nsostenuti","CFU da\nsostenere","CFU\nsostenuti","CFU da\nsostenere","Verifica"]
[{"$f":"\"i\"&VALUE(MID(A42,2,LEN(A42)-1))+1","v":"i25"},"Geo-informazione",null,{"$f":"LOOKUP(B52,scelte_1920!$A$2:$A$14, scelte_1920!$D$2:$D$14)","v":6},"Da Sostenere",{"$f":"LOOKUP(B52,scelte_1920!$A$2:$A$14, scelte_1920!$B$2:$B$14)","v":2},2,{"$f":"LOOKUP(B52,scelte_1920!$A$2:$A$14, scelte_1920!$C$2:$C$14)","v":2},"-",{"$f":"IF(I52<>\"X\",IF(E52=\"Sostenuto\",D52,\"\"),\"\")","v":""},{"$f":"IF(I52<>\"X\",IF(E52=\"Da Sostenere\",D52,\"\"),\"\")","v":6},{"$f":"IF(I52=\"X\",IF(E52=\"Sostenuto\",D52,\"\"),\"\")","v":""},{"$f":"IF(I52=\"X\",IF(E52=\"Da Sostenere\",D52,\"\"),\"\")","v":""},{"$f":"IF(OR(AND(B52<>\"-\",OR(E52=\"NO\",G52=\"-\")),AND(B52=\"-\",OR(E52<>\"NO\",G52<>\"-\"))),\"ERRORE\",\"OK\")","v":"OK"}]
[{"$f":"\"i\"&VALUE(MID(A52,2,LEN(A52)-1))+1","v":"i26"},"Identificazione e Localizzazione",null,{"$f":"LOOKUP(B53,scelte_1920!$A$2:$A$14, scelte_1920!$D$2:$D$14)","v":6},"Da Sostenere",{"$f":"LOOKUP(B53,scelte_1920!$A$2:$A$14, scelte_1920!$B$2:$B$14)","v":3},3,{"$f":"LOOKUP(B53,scelte_1920!$A$2:$A$14, scelte_1920!$C$2:$C$14)","v":2},"-","",6,"","",{"$f":"IF(OR(AND(B53<>\"-\",OR(E53=\"NO\",G53=\"-\")),AND(B53=\"-\",OR(E53<>\"NO\",G53<>\"-\"))),\"ERRORE\",\"OK\")","v":"OK"}]
[{"$f":"\"i\"&VALUE(MID(A53,2,LEN(A53)-1))+1","v":"i27"},"-",null,{"$f":"LOOKUP(B54,scelte_1920!$A$2:$A$14, scelte_1920!$D$2:$D$14)","v":"-"},"NO",{"$f":"LOOKUP(B54,scelte_1920!$A$2:$A$14, scelte_1920!$B$2:$B$14)","v":"-"},"-",{"$f":"LOOKUP(B54,scelte_1920!$A$2:$A$14, scelte_1920!$C$2:$C$14)","v":"-"},"-","","","","","OK"]
["i28","-",null,{"$f":"LOOKUP(B55,scelte_1920!$A$2:$A$14, scelte_1920!$D$2:$D$14)","v":"-"},"NO",{"$f":"LOOKUP(B55,scelte_1920!$A$2:$A$14, scelte_1920!$B$2:$B$14)","v":"-"},"-",{"$f":"LOOKUP(B55,scelte_1920!$A$2:$A$14, scelte_1920!$C$2:$C$14)","v":"-"},"-","","","","","OK"]
["i29","-",null,{"$f":"LOOKUP(B56,scelte_1920!$A$2:$A$14, scelte_1920!$D$2:$D$14)","v":"-"},"NO",{"$f":"LOOKUP(B56,scelte_1920!$A$2:$A$14, scelte_1920!$B$2:$B$14)","v":"-"},"-",{"$f":"LOOKUP(B56,scelte_1920!$A$2:$A$14, scelte_1920!$C$2:$C$14)","v":"-"},"-","","","","","OK"]
["i30","-",null,{"$f":"LOOKUP(B57,scelte_1920!$A$2:$A$14, scelte_1920!$D$2:$D$14)","v":"-"},"NO",{"$f":"LOOKUP(B57,scelte_1920!$A$2:$A$14, scelte_1920!$B$2:$B$14)","v":"-"},"-",{"$f":"LOOKUP(B57,scelte_1920!$A$2:$A$14, scelte_1920!$C$2:$C$14)","v":"-"},"-","","","","","OK"]
[]
[null,{"$f":"\"Scegliere \"&A52","v":"Scegliere i25"},null,{"$f":"IF(OR(E52=\"Da Sostenere\",E34=\"Sostenuto\"),\"OK\",\"ERRORE\")","v":"OK"}]
[null,{"$f":"\"Scegliere \"&A53","v":"Scegliere i26"},null,{"$f":"IF(OR(E53=\"Da Sostenere\",E35=\"Sostenuto\"),\"OK\",\"ERRORE\")","v":"OK"}]
[null,null,null,null,null,null,null,null,null,null,null,"Sovran-\nnumero","Sovran-\nnumero"]
[null,"Insegnamenti a scelta libera",null,"CFU","Scelta","Anno\nconsigliato","Anno\neffettivo","Semestre","Sovran-\nnumero","CFU\nsostenuti","CFU da\nsostenere","CFU\nsostenuti","CFU da\nsostenere","Verifica"]
[{"$f":"\"i\"&VALUE(MID(A57,2,LEN(A57)-1))+1","v":"i31"},null,null,null,"NO",null,"-",null,"-",{"$f":"IF(I63<>\"X\",IF(E63=\"Sostenuto\",D63,\"\"),\"\")","v":""},{"$f":"IF(I63<>\"X\",IF(E63=\"Da Sostenere\",D63,\"\"),\"\")","v":""},{"$f":"IF(I63=\"X\",IF(E63=\"Sostenuto\",D63,\"\"),\"\")","v":""},{"$f":"IF(I63=\"X\",IF(E63=\"Da Sostenere\",D63,\"\"),\"\")","v":""},{"$f":"IF(OR(AND(B63<>\"\",OR(D63=\"\",E63=\"NO\",G63=\"-\")),AND(B63=\"\",OR(D63<>\"\",E63<>\"NO\",G63<>\"-\"))),\"ERRORE\",\"OK\")","v":"OK"}]
[{"$f":"\"i\"&VALUE(MID(A63,2,LEN(A63)-1))+1","v":"i32"},null,null,null,"NO",null,"-",null,"-","","","","",{"$f":"IF(OR(AND(B64<>\"\",OR(D64=\"\",E64=\"NO\",G64=\"-\")),AND(B64=\"\",OR(D64<>\"\",E64<>\"NO\",G64<>\"-\"))),\"ERRORE\",\"OK\")","v":"OK"}]
[{"$f":"\"i\"&VALUE(MID(A64,2,LEN(A64)-1))+1","v":"i33"},null,null,null,"NO",null,"-",null,"-","","","","","OK"]
["i34",null,null,null,"NO",null,"-",null,"-","","","","","OK"]
["i35",null,null,null,"NO",null,"-",null,"-","","","","","OK"]
["i36",null,null,null,"NO",null,"-",null,"-","","","","","OK"]
[null,null,null,null,null,null,null,null,null,{"$f":"SUM(J52:J68)","v":0},12,0,0]
[null,"Totale CFU insegnamenti a scelta",null,{"$f":"SUM(J69:K69)","v":12},null,null,null,null,null,"Tot sosten.","Tot da sost.","Tot sosten.","Tot da sost."]
[null,"Totale CFU insegnamenti a scelta in sovrannumero",null,{"$f":"SUM(L69:M69)","v":0}]
[]
[]
[null,"Totale generale",null,{"$f":"D44+D70","v":165}]
[null,"Totale generale in sovrannumero",null,{"$f":"D45+D71","v":0}]
[]
[null,"Totale generale crediti >= 180",null,{"$f":" IF(D74>=180,\"OK\", \"ERRORE: numero crediti < 180\")","v":"ERRORE: numero crediti < 180"}]
[null,"Totale generale crediti <= 183",null,{"$f":" IF(D74<=183,\"OK\", \"ERRORE: numero crediti > 183\")","v":"OK"}]
[]
[]
[null,"Controllo totale numero errori",null,{"$f":"COUNTIF(N19:N42,E81)+COUNTIF(D47:D49,E81)+COUNTIF(N52:N57,E81)+COUNTIF(N63:N68,E81)+COUNTIF(D77:E78,E81)+COUNTIF(D59:D60,E81)","v":2},{"$f":"\"*\" & \"ERROR\" & \"*\"","v":"*ERROR*"}]
[null,"Risultato analisi del piano",null,{"$f":"IF(D81=0,\"IL PIANO NON CONTIENE ERRORI FORMALI\",\"IL PIANO CONTIENE DEGLI ERRORI FORMALI (\"&D81&\")\")","v":"IL PIANO CONTIENE DEGLI ERRORI FORMALI (2)"}]

{"sheet":"CommTech_1920","index":7,"n_rows":81,"n_cols":14,"rows_kept":81,"cut":false,"hidden":false,"merged":[[76,3,76,4],[80,3,80,6],[10,2,10,6],[10,8,10,11],[11,2,11,6],[11,8,11,11],[12,8,12,11],[13,2,13,4],[13,8,13,11],[14,2,14,6],[9,2,9,6],[9,8,9,11],[1,1,1,11],[2,1,2,11],[7,2,7,6],[8,2,8,6],[8,8,8,11],[7,8,7,11]]}
[]
[null,"Corso di Laurea in Ingegneria di Internet - Piano di studi 2020/21"]
[null,"Percorso \"Communication Technologies\" 2019/20"]
[null,"CFU Totali",{"$f":"D73","v":165},null,"CFU Mancanti",{"$f":"MAX(0,180-C4)","v":15}]
[null,"CFU Sovrannum.",{"$f":"D74","v":0},null,"Stato",{"$f":"D81","v":"IL PIANO CONTIENE DEGLI ERRORI FORMALI (2)"}]
[]
[]
[null,"Cognome Nome:",{"$f":"IF(PAGINA_PRINCIPALE!C8=0,\"\",PAGINA_PRINCIPALE!C8)","v":""},null,null,null,null,null,{"$f":"PAGINA_PRINCIPALE!I8","v":"ERRORE - Inserire Cognome Nome"}]
[null,"Matricola:",{"$f":"IF(PAGINA_PRINCIPALE!C9=0,\"\",PAGINA_PRINCIPALE!C9)","v":""},null,null,null,null,null,{"$f":"PAGINA_PRINCIPALE!I9","v":"ERRORE - Inserire Matricola"}]
[null,"Codice Fiscale",{"$f":"IF(PAGINA_PRINCIPALE!C10=0,\"\",PAGINA_PRINCIPALE!C10)","v":""},null,null,null,null,null,{"$f":"PAGINA_PRINCIPALE!I10","v":"ERRORE - Inserire Codice Fiscale"}]
[null,"E-mail:",{"$f":"IF(PAGINA_PRINCIPALE!C11=0,\"\",PAGINA_PRINCIPALE!C11)","v":""},null,null,null,null,null,{"$f":"PAGINA_PRINCIPALE!I11","v":"ERRORE - Inserire e-mail"}]
[null,"Telefono:",{"$f":"IF(PAGINA_PRINCIPALE!C12=0,\"\",PAGINA_PRINCIPALE!C12)","v":""},null,null,null,null,null,{"$f":"PAGINA_PRINCIPALE!I12","v":"ERRORE - Inserire Telefono"}]
[null,"Anno di Corso (I, II, III):",{"$f":"IF(PAGINA_PRINCIPALE!C13=0,\"\",PAGINA_PRINCIPALE!C13)","v":"-"},null,null,null,null,null,{"$f":"PAGINA_PRINCIPALE!I13","v":"ERRORE - Inserire Anno di Corso"}]
[null,"In corso/Fuori corso",{"$f":"IF(PAGINA_PRINCIPALE!C14=0,\"\",PAGINA_PRINCIPALE!C14)","v":"-"},null,null,null,null,null,{"$f":"PAGINA_PRINCIPALE!I14","v":"ERRORE - Indicare In corso / Fuori corso"}]
[null,null,"Compilare i campi sopra nella PAGINA_PRINCIPALE"]
[]
[null,null,null,null,null,null,null,null,null,null,null,"Sovran-\nnumero","Sovran-\nnumero"]
[null,"Insegnamenti obbligatori","Note","CFU","Scelta","Anno\nconsigliato","Anno\neffettivo","Semestre","Sovran-\nnumero","CFU\nsostenuti","CFU da\nsostenere","CFU\nsostenuti","CFU da\nsostenere","Verifica"]
["i1","Analisi Matematica I",null,12,"Da Sostenere",1,1,1,"-",{"$f":"IF(I19<>\"X\",IF(E19=\"Sostenuto\",D19,\"\"),\"\")","v":""},{"$f":"IF(I19<>\"X\",IF(E19=\"Da Sostenere\",D19,\"\"),\"\")","v":12},{"$f":"IF(I19=\"X\",IF(E19=\"Sostenuto\",D19,\"\"),\"\")","v":""},{"$f":"IF(I19=\"X\",IF(E19=\"Da Sostenere\",D19,\"\"),\"\")","v":""},{"$f":"IF(OR(AND(E19=\"NO\",G19<>\"-\"),AND(E19<>\"NO\",G19=\"-\")),\"ERRORE\",\"OK\")","v":"OK"}]
[{"$f":"\"i\"&VALUE(MID(A19,2,LEN(A19)-1))+1","v":"i2"},"Elementi di Economia e Organizzazione Aziendale",null,6,"Da Sostenere",1,1,1,"-",{"$f":"IF(I20<>\"X\",IF(E20=\"Sostenuto\",D20,\"\"),\"\")","v":""},{"$f":"IF(I20<>\"X\",IF(E20=\"Da Sostenere\",D20,\"\"),\"\")","v":6},{"$f":"IF(I20=\"X\",IF(E20=\"Sostenuto\",D20,\"\"),\"\")","v":""},{"$f":"IF(I20=\"X\",IF(E20=\"Da Sostenere\",D20,\"\"),\"\")","v":""},{"$f":"IF(OR(AND(E20=\"NO\",G20<>\"-\"),AND(E20<>\"NO\",G20=\"-\")),\"ERRORE\",\"OK\")","v":"OK"}]
[{"$f":"\"i\"&VALUE(MID(A20,2,LEN(A20)-1))+1","v":"i3"},"Fondamenti di Informatica",null,9,"Da Sostenere",1,1,1,"-","",9,"","","OK"]
["i4","Geometria e Algebra",null,9,"Da Sostenere",1,1,2,"-","",9,"","","OK"]
["i5","Fisica Generale I",null,12,"Da Sostenere",1,1,2,"-","",12,"","","OK"]
["i6","Sicurezza delle Infrastrutture ICT",{"$f":"C39","v":"(3)"},6,"Da Sostenere",1,1,2,"-","",6,"","","OK"]
["i7","Analisi Matematica II",null,9,"Da Sostenere",2,2,1,"-","",9,"","","OK"]
["i8","Elettrotecnica",null,6,"Da Sostenere",2,2,1,"-","",6,"","","OK"]
["i9","Fisica Generale II",null,6,"Da Sostenere",2,2,1,"-","",6,"","","OK"]
["i10","Probabilità, Fenomeni Aleatori ed Analisi dei Dati - 6 CFU","(1)",6,"NO",2,"-",1,"-","","","","","OK"]
["i11","Probabilità, Fenomeni Aleatori ed Analisi dei Dati - 9 CFU",{"$f":"C28","v":"(1)"},9,"Da Sostenere",2,2,1,"-","",9,"","","OK"]
["i12","Fondamenti di Controlli",{"$f":"\"(\"&VALUE(MID(C28,2,LEN(C28)-2))+1&\")\"","v":"(2)"},9,"NO",2,"-",2,"-","","","","",{"$f":"IF(OR(AND(E30=\"NO\",G30<>\"-\"),AND(E30<>\"NO\",G30=\"-\")),\"ERRORE\",\"OK\")","v":"OK"}]
["i13","Feedback Control Systems",{"$f":"C30","v":"(2)"},9,"NO",2,"-",2,"-","","","","","OK"]
["i14","Fondamenti di Elettronica",null,9,"Da Sostenere",2,2,2,"-","",9,"","","OK"]
["i15","Fondamenti di Telecomunicazioni",null,6,"Da Sostenere",2,2,2,"-","",6,"","","OK"]
["i16","Campi Elettromagnetici",null,9,"Da Sostenere",3,3,1,"-","",9,"","","OK"]
["i17","Fondamenti di Internet",null,9,"Da Sostenere",3,3,1,"-","",9,"","","OK"]
["i18","Basi di Dati e Conoscenza",null,6,"Da Sostenere",3,3,1,"-","",6,"","","OK"]
["i19","Programmazione Web",null,6,"Da Sostenere",3,3,1,"-","",6,"","","OK"]
["i20","Elaborazione Numerica dei Segnali",null,9,"Da Sostenere",3,3,2,"-","",9,"","","OK"]
["i21","Internet delle Cose",{"$f":"\"(\"&VALUE(MID(C30,2,LEN(C30)-2))+1&\")\"","v":"(3)"},6,"Da Sostenere",3,3,2,"-","",6,"","","OK"]
["i22","Lingua straniera (Inglese)",null,6,"Da Sostenere",3,3,null,"-","",6,"","","OK"]
["i23","Attività formative",null,6,"Da Sostenere",3,3,null,"-","",6,"","","OK"]
["i24","Prova finale",null,6,"Da Sostenere",3,3,null,"-","",6,"","","OK"]
[null,null,null,null,null,null,null,null,null,{"$f":"SUM(J19:J42)","v":0},162,0,0]
[null,"Totale CFU insegnamenti obbligatori",null,{"$f":"SUM(J43:K43)","v":162},null,null,null,null,null,"Tot sosten.","Tot da sost.","Tot sosten.","Tot da sost."]
[null,"Totale CFU insegnamenti obbligatori sovrannumero",null,{"$f":"SUM(L43:M43)","v":0}]
[]
[{"$f":"C28","v":"(1)"},{"$f":"\"Scegliere \"&A29&\" e non \"&A28","v":"Scegliere i11 e non i10"},null,{"$f":"IF(AND(E28=\"NO\",OR(E29=\"Da Sostenere\",E29=\"Sostenuto\")),\"OK\",\"ERRORE\")","v":"OK"}]
[{"$f":"C30","v":"(2)"},{"$f":"\"Scegliere uno tra \"&A30&\" e \"&A31","v":"Scegliere uno tra i12 e i13"},null,{"$f":"IF(_xlfn.XOR(OR(E30=\"Da Sostenere\",E30=\"Sostenuto\"),OR(E31=\"Da Sostenere\",E31=\"Sostenuto\")),\"OK\",\"ERRORE\")","v":"ERRORE"}]
[{"$f":"C39","v":"(3)"},{"$f":"\"Scegliere sia \"&A24&\" che \"&A39","v":"Scegliere sia i6 che i21"},null,{"$f":"IF(AND(OR(E24=\"Da Sostenere\",E24=\"Sostenuto\"),OR(E39=\"Da Sostenere\",E39=\"Sostenuto\")),\"OK\",\"ERRORE\")","v":"OK"}]
[null,null,null,null,null,null,null,null,null,null,null,"Sovran-\nnumero","Sovran-\nnumero"]
[null,"Insegnamenti a scelta proposti",null,"CFU","Scelta","Anno\nconsigliato","Anno\neffettivo","Semestre","Sovran-\nnumero","CFU\nsostenuti","CFU da\nsostenere","CFU\nsostenuti","CFU da\nsostenere","Verifica"]
[{"$f":"\"i\"&VALUE(MID(A42,2,LEN(A42)-1))+1","v":"i25"},"Laboratorio di Configurazione e Gestione di Reti Locali (idoneità) 3 CFU",{"$f":"\"(\"&VALUE(MID(C39,2,LEN(C39)-2))+1&\")\"","v":"(4)"},{"$f":"LOOKUP(B52,scelte_1920!$A$2:$A$14, scelte_1920!$D$2:$D$14)","v":3},"Da Sostenere",{"$f":"LOOKUP(B52,scelte_1920!$A$2:$A$14, scelte_1920!$B$2:$B$14)","v":3},3,{"$f":"LOOKUP(B52,scelte_1920!$A$2:$A$14, scelte_1920!$C$2:$C$14)","v":2},"-",{"$f":"IF(I52<>\"X\",IF(E52=\"Sostenuto\",D52,\"\"),\"\")","v":""},{"$f":"IF(I52<>\"X\",IF(E52=\"Da Sostenere\",D52,\"\"),\"\")","v":3},{"$f":"IF(I52=\"X\",IF(E52=\"Sostenuto\",D52,\"\"),\"\")","v":""},{"$f":"IF(I52=\"X\",IF(E52=\"Da Sostenere\",D52,\"\"),\"\")","v":""},{"$f":"IF(OR(AND(E52=\"NO\",G52<>\"-\"),AND(E52<>\"NO\",G52=\"-\")),\"ERRORE\",\"OK\")","v":"OK"}]
[{"$f":"\"i\"&VALUE(MID(A52,2,LEN(A52)-1))+1","v":"i26"},"Laboratorio di Configurazione e Gestione di Reti Locali (idoneità) 6 CFU",{"$f":"C52","v":"(4)"},{"$f":"LOOKUP(B53,scelte_1920!$A$2:$A$14, scelte_1920!$D$2:$D$14)","v":6},"NO",{"$f":"LOOKUP(B53,scelte_1920!$A$2:$A$14, scelte_1920!$B$2:$B$14)","v":3},"-",{"$f":"LOOKUP(B53,scelte_1920!$A$2:$A$14, scelte_1920!$C$2:$C$14)","v":2},"-","","","","","OK"]
[{"$f":"\"i\"&VALUE(MID(A53,2,LEN(A53)-1))+1","v":"i27"},"-",null,{"$f":"LOOKUP(B54,scelte_1920!$A$2:$A$14, scelte_1920!$D$2:$D$14)","v":"-"},"NO",{"$f":"LOOKUP(B54,scelte_1920!$A$2:$A$14, scelte_1920!$B$2:$B$14)","v":"-"},"-",{"$f":"LOOKUP(B54,scelte_1920!$A$2:$A$14, scelte_1920!$C$2:$C$14)","v":"-"},"-","","","","",{"$f":"IF(OR(AND(B54<>\"-\",OR(E54=\"NO\",G54=\"-\")),AND(B54=\"-\",OR(E54<>\"NO\",G54<>\"-\"))),\"ERRORE\",\"OK\")","v":"OK"}]
["i28","-",null,{"$f":"LOOKUP(B55,scelte_1920!$A$2:$A$14, scelte_1920!$D$2:$D$14)","v":"-"},"NO",{"$f":"LOOKUP(B55,scelte_1920!$A$2:$A$14, scelte_1920!$B$2:$B$14)","v":"-"},"-",{"$f":"LOOKUP(B55,scelte_1920!$A$2:$A$14, scelte_1920!$C$2:$C$14)","v":"-"},"-","","","","","OK"]
["i29","-",null,{"$f":"LOOKUP(B56,scelte_1920!$A$2:$A$14, scelte_1920!$D$2:$D$14)","v":"-"},"NO",{"$f":"LOOKUP(B56,scelte_1920!$A$2:$A$14, scelte_1920!$B$2:$B$14)","v":"-"},"-",{"$f":"LOOKUP(B56,scelte_1920!$A$2:$A$14, scelte_1920!$C$2:$C$14)","v":"-"},"-","","","","","OK"]
["i30","-",null,{"$f":"LOOKUP(B57,scelte_1920!$A$2:$A$14, scelte_1920!$D$2:$D$14)","v":"-"},"NO",{"$f":"LOOKUP(B57,scelte_1920!$A$2:$A$14, scelte_1920!$B$2:$B$14)","v":"-"},"-",{"$f":"LOOKUP(B57,scelte_1920!$A$2:$A$14, scelte_1920!$C$2:$C$14)","v":"-"},"-","","","","","OK"]
[]
[{"$f":"C52","v":"(4)"},{"$f":"\"Scegliere uno tra \"&A52&\" e \"&A53","v":"Scegliere uno tra i25 e i26"},null,{"$f":"IF(_xlfn.XOR(OR(E52=\"Da Sostenere\",E52=\"Sostenuto\"),OR(E53=\"Da Sostenere\",E53=\"Sostenuto\")),\"OK\",\"ERRORE\")","v":"OK"}]
[null,null,null,null,null,null,null,null,null,null,null,"Sovran-\nnumero","Sovran-\nnumero"]
[null,"Insegnamenti a scelta libera",null,"CFU","Scelta","Anno\nconsigliato","Anno\neffettivo","Semestre","Sovran-\nnumero","CFU\nsostenuti","CFU da\nsostenere","CFU\nsostenuti","CFU da\nsostenere","Verifica"]
[{"$f":"\"i\"&VALUE(MID(A57,2,LEN(A57)-1))+1","v":"i31"},null,null,null,"NO",null,"-",null,"-",{"$f":"IF(I62<>\"X\",IF(E62=\"Sostenuto\",D62,\"\"),\"\")","v":""},{"$f":"IF(I62<>\"X\",IF(E62=\"Da Sostenere\",D62,\"\"),\"\")","v":""},{"$f":"IF(I62=\"X\",IF(E62=\"Sostenuto\",D62,\"\"),\"\")","v":""},{"$f":"IF(I62=\"X\",IF(E62=\"Da Sostenere\",D62,\"\"),\"\")","v":""},{"$f":"IF(OR(AND(B62<>\"\",OR(D62=\"\",E62=\"NO\",G62=\"-\")),AND(B62=\"\",OR(D62<>\"\",E62<>\"NO\",G62<>\"-\"))),\"ERRORE\",\"OK\")","v":"OK"}]
[{"$f":"\"i\"&VALUE(MID(A62,2,LEN(A62)-1))+1","v":"i32"},null,null,null,"NO",null,"-",null,"-","","","","",{"$f":"IF(OR(AND(B63<>\"\",OR(D63=\"\",E63=\"NO\",G63=\"-\")),AND(B63=\"\",OR(D63<>\"\",E63<>\"NO\",G63<>\"-\"))),\"ERRORE\",\"OK\")","v":"OK"}]
[{"$f":"\"i\"&VALUE(MID(A63,2,LEN(A63)-1))+1","v":"i33"},null,null,null,"NO",null,"-",null,"-","","","","","OK"]
["i34",null,null,null,"NO",null,"-",null,"-","","","","","OK"]
["i35",null,null,null,"NO",null,"-",null,"-","","","","","OK"]
["i36",null,null,null,"NO",null,"-",null,"-","","","","","OK"]
[null,null,null,null,null,null,null,null,null,{"$f":"SUM(J52:J67)","v":0},3,0,0]
[null,"Totale CFU insegnamenti a scelta",null,{"$f":"SUM(J68:K68)","v":3},null,null,null,null,null,"Tot sosten.","Tot da sost.","Tot sosten.","Tot da sost."]
[null,"Totale CFU insegnamenti a scelta in sovrannumero",null,{"$f":"SUM(L68:M68)","v":0}]
[]
[]
[null,"Totale generale",null,{"$f":"D44+D69","v":165}]
[null,"Totale generale in sovrannumero",null,{"$f":"D45+D70","v":0}]
[]
[null,"Totale generale crediti >= 180",null,{"$f":" IF(D73>=180,\"OK\", \"ERRORE: numero crediti < 180\")","v":"ERRORE: numero crediti < 180"}]
[null,"Totale generale crediti <= 183",null,{"$f":" IF(D73<=183,\"OK\", \"ERRORE: numero crediti > 183\")","v":"OK"}]
[]
[]
[null,"Controllo totale numero errori",null,{"$f":"COUNTIF(N19:N42,E80)+COUNTIF(D47:D49,E80)+COUNTIF(N52:N57,E80)+COUNTIF(N62:N67,E80)+COUNTIF(D76:E77,E80)+COUNTIF(D59:D59,E80)","v":2},{"$f":"\"*\" & \"ERROR\" & \"*\"","v":"*ERROR*"}]
[null,"Risultato analisi del piano",null,{"$f":"IF(D80=0,\"IL PIANO NON CONTIENE ERRORI FORMALI\",\"IL PIANO CONTIENE DEGLI ERRORI FORMALI (\"&D80&\")\")","v":"IL PIANO CONTIENE DEGLI ERRORI FORMALI (2)"}]

{"sheet":"scelte_1920","index":8,"n_rows":14,"n_cols":4,"rows_kept":14,"cut":false,"hidden":true,"merged":[]}
["THE LIST NEEDS TO BE SORTED!!!!","anno","semestre","CFU"]
["-","-","-","-"]
["Geo-informazione",2,2,6]
["Identificazione e Localizzazione",3,2,6]
["Laboratorio di Configurazione e Gestione di Reti Locali (idoneità) 3 CFU",3,2,3]
["Laboratorio di Configurazione e Gestione di Reti Locali (idoneità) 6 CFU",3,2,6]
["Modelli e Linguaggi di Simulazione",3,2,6]
["Programmazione Java per Dispositivi Mobili",3,2,6]
["Sistemi Operativi",2,1,6]
["Sistemi Sensoriali",3,1,6]
["Tecnologie per le Comunicazioni in Fibra Ottica",3,2,6]
["Tirocinio Formativo (3 CFU)",null,null,3]
["Tirocinio Formativo (6 CFU)",null,null,6]
["Vulnerabilità e Difesa dei Sistemi Internet",3,2,6]

{"sheet":"scelte_1819","index":9,"n_rows":16,"n_cols":4,"rows_kept":16,"cut":false,"hidden":true,"merged":[]}
["THE LIST NEEDS TO BE SORTED!!!!","anno","semestre","CFU"]
["-","-","-","-"]
["Geo-informazione",2,2,6]
["Identificazione e Localizzazione",3,2,6]
["Internet delle Cose",3,2,6]
["Laboratorio di Configurazione e Gestione di Reti Locali (idoneità) 3 CFU",3,2,3]
["Laboratorio di Configurazione e Gestione di Reti Locali (idoneità) 6 CFU",3,2,6]
["Modelli e Linguaggi di Simulazione",3,2,6]
["Programmazione Java per Dispositivi Mobili",3,2,6]
["Sicurezza delle Infrastrutture ICT",1,2,6]
["Sistemi Operativi",2,1,6]
["Sistemi Sensoriali",3,1,6]
["Tecnologie per le Comunicazioni in Fibra Ottica",3,2,6]
["Tirocinio Formativo (3 CFU)",null,null,3]
["Tirocinio Formativo (6 CFU)",null,null,6]
["Vulnerabilità e Difesa dei Sistemi Internet",3,2,6]